{"text_format":"2","workbook":"xlsx","n_sheets":8,"sheets":["Resumo Total","Mao de Obra","Mão de Obra  (Detalhamento)","Outras Despesas (Adm_Manut)","Custo Adminstração (Detalham)","Despesas Fiscais","Encargos Sociais","Base de Preço (Salários)"],"not_rendered":{"charts":0,"images":8,"macros":0,"external_links":0,"defined_names":11,"comments":3,"pivot_tables":0},"unopened":[],"bounds":{"document_bytes":16777216,"sheet_cells":100000,"run_cost":"one","rows_first":2000,"rows_last":500,"rows_between":2000,"halvings":0,"cell_chars":16384,"cell_head_chars":4096},"cells_cut":0,"cells_raw":0,"read":"whole","date_system":"1900"}

{"sheet":"Resumo Total","index":0,"n_rows":27,"n_cols":7,"rows_kept":27,"cut":false,"hidden":false,"merged":[[27,0,27,2],[28,0,28,2],[29,0,29,2],[22,0,22,1],[23,0,23,1],[24,0,24,1],[25,0,25,1],[26,0,26,2],[10,0,12,0],[10,1,12,1],[10,2,12,2],[19,0,19,1],[0,0,0,2],[1,0,1,2],[2,0,2,2],[8,0,8,2],[4,0,6,2]]}
["Ministério do Desenvolvimento Regional - MDR\n"]
["Companhia de Desenvolvimento dos Vales do São Francisco e do Parnaíba\n"]
[]
[]
["CONTRATAÇÃO DOS SERVIÇOS TÉCNICOS ESPECIALIZADOS DE APOIO ÀS ATIVIDADES DA GESTÃO DO PROJETO DE INTEGRAÇÃO DO RIO SÃO FRANCISCO COM AS BACIAS HIDROGRÁFICAS DO NORDESTE SETENTRIONAL – PISF"]
[]
[]
[]
["RESUMO GERAL"]
[]
["ITEM","DISCRIMINAÇÃO","Preço Total (R$)"]
[]
[]
["1.","Mão-de-Obra (Incluindo Encargos Sociais, Benefícios e Despesas Indiretas)",{"$f":"'Mao de Obra'!C28","v":0}]
["2.","Outras Despesas (Incluindo Despesas Indiretas)",{"$f":"SUM(C16:C19)","v":0}]
["2.1","Escritório (Aluguel, mobiliário, Manutenção, etc)",{"$f":"'Outras Despesas (Adm_Manut)'!K13","v":0}]
["2.2","Veículos",{"$f":"'Outras Despesas (Adm_Manut)'!K22","v":0}]
["2.3","Equipamentos Diversos",{"$f":"'Outras Despesas (Adm_Manut)'!K25","v":0}]
["2.4","Viagens/Diárias (Pagos por Demanda)",{"$f":"'Outras Despesas (Adm_Manut)'!K30","v":0},null,null,null," "]
["Total Geral (R$):",null,{"$f":"C14+C15","v":0}]
[]
[]
["NOME DO INFORMANTE:",null,"QUALIFICAÇÃO:"]
[]
["ASSINATURA:",null,"DATA:"]
[]
["OBSERVAÇÃO:"]

{"sheet":"Mao de Obra","index":1,"n_rows":33,"n_cols":3,"rows_kept":33,"cut":false,"hidden":false,"merged":[[12,0,12,2],[13,0,13,1],[0,0,0,2],[1,0,1,2],[2,0,2,2],[5,0,7,2],[10,0,10,2],[32,0,32,1],[30,0,30,1],[21,0,21,2],[25,0,25,1],[27,0,27,1]]}
["Ministério do Desenvolvimento Regional - MDR\n"]
["Companhia de Desenvolvimento dos Vales do São Francisco e do Parnaíba\n"]
[]
[]
[]
["CONTRATAÇÃO DOS SERVIÇOS TÉCNICOS ESPECIALIZADOS DE APOIO ÀS ATIVIDADES DA GESTÃO DO PROJETO DE INTEGRAÇÃO DO RIO SÃO FRANCISCO COM AS BACIAS HIDROGRÁFICAS DO NORDESTE SETENTRIONAL – PISF"]
[]
[]
[]
[]
["MÃO-DE-OBRA"]
[]
["CUSTOS DIRETOS"]
["MÃO DE OBRA (A+B)",null,{"$f":"C15+C19","v":0}]
["A","EQUIPE",{"$f":"SUM(C16:C18)","v":0}]
["A1","Com Vínculo",{"$f":"'Mão de Obra  (Detalhamento)'!K61","v":0}]
["A2","Consultoria",{"$f":"'Mão de Obra  (Detalhamento)'!K62","v":0}]
["A3","Outros Custos (PERICULOSIDADE)",{"$f":"'Mão de Obra  (Detalhamento)'!L63","v":0}]
["B","ENCARGOS SOCIAIS",{"$f":"SUM(C20:C21)","v":0}]
["B1","INCIDENTE SOBRE O ITEM  A1 + A3",{"$f":"'Mão de Obra  (Detalhamento)'!M61","v":0}]
["B2","INCIDENTE SOBRE O ITEM  A2",{"$f":"'Mão de Obra  (Detalhamento)'!M62","v":0}]
["CUSTOS INDIRETOS"]
["C","CUSTO DE ADMINISTRAÇÃO   (TAXA DE 15,50% DO ITEM 'A')",{"$f":"0.155*C15","v":0}]
["D","REMUNERAÇÃO DE ESCRITÓRIO (TAXA DE 2,5% DOS ITENS (A + B + C)",{"$f":"0.025*(C14+C23)","v":0}]
["E","DESPESAS FISCAIS ( 16,62% DOS ITENS A + B + C + D)",{"$f":"0.1662*(C14+C23+C24)","v":0}]
["CUSTOS INDIRETOS - Total (R$):",null,{"$f":"SUM(C23:C25)","v":0}]
[]
["PREÇO TOTAL - MÃO-DE-OBRA (R$):",null,{"$f":"C14+C26","v":0}]
[]
[]
["NOME DO INFORMANTE:",null,"QUALIFICAÇÃO:"]
[]
["ASSINATURA:",null,"DATA:"]

{"sheet":"Mão de Obra  (Detalhamento)","index":2,"n_rows":69,"n_cols":14,"rows_kept":69,"cut":false,"hidden":false,"merged":[[70,0,70,13],[71,0,71,13],[0,0,0,13],[1,0,1,13],[2,0,2,13],[3,0,4,13],[6,0,6,13],[12,6,12,9],[13,6,14,6],[13,8,14,8],[13,9,14,9],[12,0,14,0],[12,1,14,1],[12,2,14,2],[12,3,14,3],[12,4,14,4],[12,5,14,5],[68,0,68,13],[69,0,69,13],[13,7,14,7],[12,10,12,13],[13,10,14,10],[13,11,14,11],[13,12,14,12],[13,13,14,13],[15,1,15,13],[60,0,60,9],[61,0,61,9],[66,11,66,13],[67,11,67,13],[66,0,66,10],[67,0,67,10],[9,4,9,5],[9,2,9,3],[10,2,10,3],[10,4,10,5],[9,6,9,7],[10,6,10,7],[10,8,10,9],[9,10,9,11],[10,10,10,11],[9,12,9,13],[10,12,10,13],[64,0,64,10],[65,0,65,10],[64,11,64,13],[65,11,65,13],[8,2,8,13],[62,0,62,9],[17,1,17,13],[25,1,25,13],[27,1,27,13],[30,1,30,13],[31,1,31,13],[40,1,40,13],[45,1,45,13],[52,1,52,13],[58,1,58,13],[9,8,9,9]]}
["Ministério do Desenvolvimento Regional - MDR\n"]
["Companhia de Desenvolvimento dos Vales do São Francisco e do Parnaíba\n"]
[]
["CONTRATAÇÃO DOS SERVIÇOS TÉCNICOS ESPECIALIZADOS DE APOIO ÀS ATIVIDADES DA GESTÃO DO PROJETO DE INTEGRAÇÃO DO RIO SÃO FRANCISCO COM AS BACIAS HIDROGRÁFICAS DO NORDESTE SETENTRIONAL – PISF"]
[]
[]
["MÃO DE OBRA"]
[]
[null,null,"Encargos Sociais"]
[null,null,"Periculosidade",null,"Horista (DF):",null,"Horista (PE):",null,"Mensalista (DF):",null,"Mensalista (PE):",null,"Sem Vínculo"]
[null,null,0.3,null,1.1409,null,1.1503000000000001,null,0.73429999999999995,null,0.7107,null,0.2]
[]
["ITEM","DISCRIMINAÇÃO","CODIGO","UND","QTD","Prazo (Mês)","SALÁRIOS MENSAL (R$)",null,null,null,"SALÁRIOS TOTAL (R$)"]
[{"$nulls":6},"SEM Encargo","Periculosidade (30%)","Encargos Sociais","COM Encargo","SEM Encargo","Periculosidade (30%)","Encargos Sociais","COM Encargo"]
[]
["1.","COORDENAÇÃO GERAL"]
["1.1","Gerente de Contrato - Engenheiro Senior","P0","und/mês",1,12,{"$f":"VLOOKUP(C17,'Base de Preço (Salários)'!$A$12:$D$29,4,FALSE)","v":0},0,{"$f":"ROUND((G17+H17)*$K$11,2)","v":0},{"$f":"G17+H17+I17","v":0},{"$f":"E17*F17*G17","v":0},{"$f":"E17*F17*H17","v":0},{"$f":"ROUND((K17+L17)*$K$11,2)","v":0},{"$f":"K17+L17+M17","v":0}]
["2.","ADMINISTRAÇÃO E LOGÍSTICA"]
["2.1","Coordenador Administrativo Financeiro (Chefe de Escritório)","AS","und/mês",1,12,{"$f":"VLOOKUP(C19,'Base de Preço (Salários)'!$A$12:$D$29,4,FALSE)","v":0},0,{"$f":"ROUND((G19+H19)*$K$11,2)","v":0},{"$f":"G19+H19+I19","v":0},{"$f":"E19*F19*G19","v":0},{"$f":"E19*F19*H19","v":0},{"$f":"(K19+L19)*$K$11","v":0},{"$f":"K19+L19+M19","v":0}]
["2.2","Assistente Administrativo","A1","und/mês",1,12,{"$f":"VLOOKUP(C20,'Base de Preço (Salários)'!$A$12:$D$29,4,FALSE)","v":0},0,0,{"$f":"G20+H20+I20","v":0},{"$f":"E20*F20*G20","v":0},{"$f":"E20*F20*H20","v":0},0,{"$f":"K20+L20+M20","v":0}]
["2.3","Ajudante Administrativo","A2","und/mês",1,12,{"$f":"VLOOKUP(C21,'Base de Preço (Salários)'!$A$12:$D$29,4,FALSE)","v":0},0,0,{"$f":"G21+H21+I21","v":0},{"$f":"E21*F21*G21","v":0},{"$f":"E21*F21*H21","v":0},0,{"$f":"K21+L21+M21","v":0}]
["2.4","Técnico Pleno - TI","T1","und/mês",1,12,{"$f":"VLOOKUP(C22,'Base de Preço (Salários)'!$A$12:$D$29,4,FALSE)","v":0},0,0,0,0,0,0,{"$f":"K22+L22+M22","v":0}]
["2.5","Serviços Gerais (Limpeza / Copa)","A4","und/mês",1,12,{"$f":"VLOOKUP(C23,'Base de Preço (Salários)'!$A$12:$D$29,4,FALSE)","v":0},0,0,{"$f":"G23+H23+I23","v":0},0,0,0,{"$f":"+K23+L23+M23","v":0}]
["2.6","Vigia Noturno","A4.1","und/mês",1,12,{"$f":"VLOOKUP(C24,'Base de Preço (Salários)'!$A$12:$D$30,4,FALSE)","v":0},{"$f":"ROUND(G24*$C$11,2)","v":0},0,0,0,0,0,{"$f":"K24+L24+M24","v":0}]
["2.7","Motorista","A3","und/mês",1,12,{"$f":"VLOOKUP(C25,'Base de Preço (Salários)'!$A$12:$D$29,4,FALSE)","v":0},0,0,0,0,0,0,{"$f":"K25+L25+M25","v":0}]
["3.","COMUNICAÇÃO SOCIAL"]
["3.1","Profissional Médio em Comunicação - Jornalista","P2","und/mês",1,12,{"$f":"VLOOKUP(C27,'Base de Preço (Salários)'!$A$12:$D$29,4,FALSE)","v":0},null,{"$f":"ROUND((G27+H27)*$K$11,2)","v":0},{"$f":"G27+H27+I27","v":0},{"$f":"E27*F27*G27","v":0},0,{"$f":"(K27+L27)*$K$11","v":0},{"$f":"K27+L27+M27","v":0}]
["4.","MEIO AMBIENTE E SEGURANÇA E SAÚDE OCUPACIONAL"]
["4.1","Engenheiro Pleno - Ambiental","P1","und/mês",1,12,{"$f":"VLOOKUP(C29,'Base de Preço (Salários)'!$A$12:$D$29,4,FALSE)","v":0},0,{"$f":"ROUND((G29+H29)*$K$11,2)","v":0},{"$f":"G29+H29+I29","v":0},{"$f":"E29*F29*G29","v":0},0,{"$f":"(K29+L29)*$K$11","v":0},{"$f":"K29+L29+M29","v":0}]
["4.2","Engenheiro Médio (Engenheiro Segurança do Trabalho)","P2","und/mês",1,12,{"$f":"VLOOKUP(C30,'Base de Preço (Salários)'!$A$12:$D$29,4,FALSE)","v":0},{"$f":"ROUND(G30*$C$11,2)","v":0},{"$f":"ROUND((G30+H30)*$K$11,2)","v":0},{"$f":"G30+H30+I30","v":0},{"$f":"E30*F30*G30","v":0},0,{"$f":"(K30+L30)*$K$11","v":0},{"$f":"K30+L30+M30","v":0}]
["5.","ENGENHARIA"]
["5.1.","CIVIL"]
["5.1.1","Engenheiro Pleno - Civil","P1","und/mês",2,12,{"$f":"VLOOKUP(C33,'Base de Preço (Salários)'!$A$12:$D$29,4,FALSE)","v":0},{"$f":"ROUND(G33*$C$11,2)","v":0},{"$f":"ROUND((G33+H33)*$K$11,2)","v":0},{"$f":"G33+H33+I33","v":0},{"$f":"E33*F33*G33","v":0},{"$f":"E33*F33*H33","v":0},{"$f":"(K33+L33)*$K$11","v":0},{"$f":"K33+L33+M33","v":0}]
["5.1.2","Engenheiro Pleno - Hidrólogo (Civil)","P1","und/mês",1,12,{"$f":"VLOOKUP(C34,'Base de Preço (Salários)'!$A$12:$D$29,4,FALSE)","v":0},0,0,0,0,0,0,0]
["5.1.3","Engenheiro Pleno - Geotécnico/Geólogo","P1","und/mês",1,12,{"$f":"VLOOKUP(C35,'Base de Preço (Salários)'!$A$12:$D$29,4,FALSE)","v":0},0,0,0,0,0,0,0]
["5.1.4","Engenheiro Júnior - Civil","P3","und/mês",2,12,{"$f":"VLOOKUP(C36,'Base de Preço (Salários)'!$A$12:$D$29,4,FALSE)","v":0},0,0,0,0,{"$f":"E36*F36*H36","v":0},0,0]
["5.1.5","Engenheiro Júnior - Hidrólogo (Civil)","P3","und/mês",1,12,{"$f":"VLOOKUP(C37,'Base de Preço (Salários)'!$A$12:$D$29,4,FALSE)","v":0},0,0,{"$f":"G37+H37+I37","v":0},{"$f":"E37*F37*G37","v":0},0,0,0]
["5.1.6","Engenheiro Júnior - Geotécnico/Geólogo","P3","und/mês",1,12,{"$f":"VLOOKUP(C38,'Base de Preço (Salários)'!$A$12:$D$29,4,FALSE)","v":0},0,0,0,0,0,0,0]
["5.1.7","Topógrafo","TS","und/mês",1,12,{"$f":"VLOOKUP(C39,'Base de Preço (Salários)'!$A$12:$D$29,4,FALSE)","v":0},0,0,0,0,{"$f":"E39*F39*H39","v":0},0,0]
["5.1.8","Auxiliar de Topografia","T3","und/mês",{"$f":"E39*2","v":2},12,{"$f":"VLOOKUP(C40,'Base de Preço (Salários)'!$A$12:$D$29,4,FALSE)","v":0},0,0,0,0,{"$f":"E40*F40*H40","v":0},0,0]
{"$rows_left_out":30}
{"sheet":"Outras Despesas (Adm_Manut)","index":3,"n_rows":55,"n_cols":11,"rows_kept":55,"cut":false,"hidden":false,"merged":[[54,1,54,10],[43,9,44,10],[43,0,44,8],[12,1,12,9],[0,0,0,10],[1,0,1,10],[2,0,2,10],[4,0,5,10],[7,0,7,10],[9,0,11,0],[9,1,11,1],[9,2,11,2],[9,3,11,3],[9,4,11,4],[9,5,11,5],[9,6,11,6],[9,10,11,10],[9,7,11,7],[21,1,21,9],[9,8,10,8],[9,9,10,9],[24,1,24,9],[29,1,29,9],[33,0,33,6],[41,8,42,10],[41,0,42,7],[47,1,47,10],[36,0,36,6],[37,0,37,6],[38,0,38,6],[48,1,48,10],[45,0,45,10],[46,1,46,10],[53,1,53,10],[52,1,52,10],[50,1,50,10],[51,1,51,10],[49,1,49,10]]}
["Ministério do Desenvolvimento Regional - MDR\n"]
["Companhia de Desenvolvimento dos Vales do São Francisco e do Parnaíba\n"]
[]
[]
["CONTRATAÇÃO DOS SERVIÇOS TÉCNICOS ESPECIALIZADOS DE APOIO ÀS ATIVIDADES DA GESTÃO DO PROJETO DE INTEGRAÇÃO DO RIO SÃO FRANCISCO COM AS BACIAS HIDROGRÁFICAS DO NORDESTE SETENTRIONAL – PISF"]
[]
[]
["OUTRAS DESPESAS - ADMINISTRAÇÃO / MANUTENÇÃO DOS ESCRITORIOS"]
[]
["ITEM","DISCRIMINAÇÃO","UND","QTD","Prazo (Mês)","Qnt total de Meses","Custo Unitário (R$)","Custo Total (R$)","Remuneração de Escritório (R$)","Despesas Fiscais (R$)","PREÇO TOTAL (R$)"]
[]
[{"$nulls":8},2.5000000000000001E-2,0.16619999999999999]
["1.","Escritório - Admnistração e Logística",{"$nulls":8},{"$f":"SUM(K14:K21)","v":0}]
["1.1","Aluguel","Und/Mês",1,12,{"$f":"D14*E14","v":12},null,{"$f":"F14*G14","v":0},{"$f":"(H14*$I$12)","v":0},{"$f":"(H14+I14)*$J$12","v":0},{"$f":"H14+I14+J14","v":0}]
["1.2","Mobiliário para Escritório","Und/Mês",1,12,{"$f":"D15*E15","v":12},null,{"$f":"F15*G15","v":0},{"$f":"(H15*$I$12)","v":0},0,{"$f":"H15+I15+J15","v":0}]
["1.3","Telefone / Internet","und x mês",1,12,{"$f":"D16*E16","v":12},null,{"$f":"F16*G16","v":0},{"$f":"(H16*$I$12)","v":0},0,{"$f":"H16+I16+J16","v":0}]
["1.4","Telefone Celular","und x mês",16,12,192,null,0,0,0,0]
["1.5","Energia elétrica - Escritórios Apoio Logistico","und x mês",{"$f":"D14","v":1},12,12,null,0,0,0,0]
["1.6","Água e esgoto - Escritórios Apoio Logistico","und x mês",{"$f":"D14","v":1},12,12,null,0,0,0,0]
["1.7","Material de escritório - Apoio","und x mês",{"$f":"D14","v":1},12,12,null,0,0,0,0]
["1.8","Material de limpeza / higiene - Central","und x mês",1,12,12,null,0,0,0,0]
["2.","Veículos",{"$nulls":8},{"$f":"SUM(K23:K24)","v":0}]
["2.1","Aluguel de veículo leve  tipo Sedan 1.6 Flex","und x mês",2,12,{"$f":"D23*E23","v":24},null,0,0,{"$f":"(H23+I23)*$J$12","v":0},{"$f":"H23+I23+J23","v":0}]
["2.2","Aluguel de veículo tipo pick-up cabine dupla 4x4","und x mês",15,12,{"$f":"D24*E24","v":180},null,0,0,{"$f":"(H24+I24)*$J$12","v":0},0]
["3.","Equipamentos Diversos",{"$nulls":8},{"$f":"SUM(K26:K29)","v":0}]
["3.1","Instrumental de Topografia (Estação total classe III, Nível classe 2, GPS, Micro/Soft, Radio/Foto, etc)","und x mês",1,12,{"$f":"D26*E26","v":12},null,0,0,{"$f":"(H26+I26)*$J$12","v":0},{"$f":"H26+I26+J26","v":0}]
["3.2","Notebook","und x mês",39,12,{"$f":"D27*E27","v":468},null,{"$f":"F27*G27","v":0},0,{"$f":"(H27+I27)*$J$12","v":0},{"$f":"H27+I27+J27","v":0}]
["3.3","Desktop","und x mês",3,12,{"$f":"D28*E28","v":36},null,{"$f":"F28*G28","v":0},0,{"$f":"(H28+I28)*$J$12","v":0},{"$f":"H28+I28+J28","v":0}]
["3.4","Impressoras","und x mês",1,12,{"$f":"D29*E29","v":12},null,{"$f":"F29*G29","v":0},0,{"$f":"(H29+I29)*$J$12","v":0},{"$f":"H29+I29+J29","v":0}]
["4.","VIAGENS / DIÁRIAS",{"$nulls":8},{"$f":"SUM(K31:K33)","v":0}]
["4.1","Viagens (trecho aéreos)","und",80,1,{"$f":"D31*E31","v":80},null,{"$f":"D31*E31*G31","v":0},0,{"$f":"(H31+I31)*$J$12","v":0},{"$f":"H31+I31+J31","v":0}]
["4.2","Diária Nacional - Capital","und",48,1,{"$f":"D32*E32","v":48},null,{"$f":"D32*G32","v":0},0,{"$f":"(H32+I32)*$J$12","v":0},{"$f":"H32+I32+J32","v":0}]
["4.3","Diárias Nacional - Interior","und",2136,1,12,null,{"$f":"D33*G33","v":0},0,{"$f":"(H33+I33)*$J$12","v":0},{"$f":"H33+I33+J33","v":0}]
["TOTAL(custos diretos) - OUTRAS DESPESAS (R$):",{"$nulls":6},{"$f":"SUM(H14:H33)","v":0},{"$f":"SUM(I14:I33)","v":0},{"$f":"SUM(J14:J33)","v":0},{"$f":"K13+K22+K25+K30","v":0}]
[]
[]
["REMUNERAÇÃO DE ESCRITÓRIO (TAXA DE 2,5% DOS ITENS - OUTRAS DESPESAS):",{"$nulls":6},{"$f":"0.025*H34","v":0}]
["DESPESAS FISCAIS ( 16,62% DOS ITENS Outras Despesas + Remuneração escritório):",{"$nulls":6},{"$f":"0.1662*(H34+H37)","v":0}]
["CUSTOS INDIRETOS - Total (R$):",{"$nulls":6},{"$f":"SUM(H37:H38)","v":0}]
[]
{"$rows_left_out":16}
{"sheet":"Custo Adminstração (Detalham)","index":4,"n_rows":28,"n_cols":3,"rows_kept":28,"cut":false,"hidden":false,"merged":[[12,2,14,2],[15,2,17,2],[23,0,24,1],[25,0,26,1],[27,0,30,2],[21,0,21,1],[12,1,14,1],[12,0,14,0],[15,0,17,0],[15,1,17,1],[18,1,20,1],[18,0,20,0],[18,2,20,2],[0,0,0,2],[1,0,1,2],[2,0,2,2],[8,0,8,2],[11,0,11,1],[4,0,6,2]]}
["Ministério do Desenvolvimento Regional - MDR\n"]
["Companhia de Desenvolvimento dos Vales do São Francisco e do Parnaíba\n"]
[]
[]
["CONTRATAÇÃO DOS SERVIÇOS TÉCNICOS ESPECIALIZADOS DE APOIO ÀS ATIVIDADES DA GESTÃO DO PROJETO DE INTEGRAÇÃO DO RIO SÃO FRANCISCO COM AS BACIAS HIDROGRÁFICAS DO NORDESTE SETENTRIONAL – PISF"]
[]
[]
[]
["CUSTOS ADMINISTRAÇÃO - DETALHAMENTO"]
[]
[]
["DISCRIMINAÇÃO",null,"%"]
[1,"Custos da equipe da administração central da empresa consultora ( diretoria, pessoal técnico de apoio e pessoal administrativo não diretamente vinculado à prestação dos serviços)"]
[]
[]
[2,"Outras despesas que afetam o custo de produção (como treinamento, EPI, biblioteca, programa de qualidade, auditoria interna e externa, entre outros)"]
[]
[]
[3,"Despesas com aluguéis, comunicação, manutenção e transporte não diretamente relacionados com o custo direto dos serviços"]
[]
[]
["TOTAIS DO CUSTO DE ADMINISTRAÇÃO",null,{"$f":"SUM(C13:C20)","v":0}]
[]
["NOME DO INFORMANTE:",null,"QUALIFICAÇÃO:"]
[]
["ASSINATURA:",null,"DATA:"]
[]
["OBSERVAÇAO:"]

{"sheet":"Despesas Fiscais","index":5,"n_rows":34,"n_cols":4,"rows_kept":34,"cut":false,"hidden":false,"merged":[[33,0,34,3],[4,0,6,3],[0,0,0,3],[1,0,1,3],[2,0,2,3],[8,0,8,3],[31,0,32,3],[22,0,22,3],[7,0,7,3],[14,0,14,1],[10,0,10,1],[18,0,19,1],[18,2,19,3],[20,3,21,3],[20,0,21,2],[29,0,29,3],[30,0,30,3],[27,0,28,3],[23,0,24,3],[25,0,26,3]]}
["Ministério do Desenvolvimento Regional - MDR\n"]
["Companhia de Desenvolvimento dos Vales do São Francisco e do Parnaíba\n"]
[]
[]
["CONTRATAÇÃO DE APOIO TÉCNICO PARA ACOMPANHAMENTO DAS ATIVIDADES DA GESTÃO DO PROJETO DE INTEGRAÇÃO DO RIO SÃO FRANCISCO COM AS BACIAS HIDROGRÁFICAS DO NORDESTE SETENTRIONAL – PISF"]
[]
[]
[]
["DESPESAS FISCAIS - DETALHAMENTO"]
[]
["DISCRIMINAÇÃO",null,"DF %","DF' %"]
[1,"1 - ISS",null,{"$f":"(1/(1-$C$15/100))*C12","v":0}]
[2,"2 - PIS",null,{"$f":"(1/(1-$C$15/100))*C13","v":0}]
[3,"3 - COFINS",null,{"$f":"(1/(1-$C$15/100))*C14","v":0}]
["TOTAIS DE DESPESAS FISCAIS: ",null,{"$f":"C12+C13+C14","v":0},{"$f":"D12+D13+D14","v":0}]
[]
[]
[]
["NOME DO INFORMANTE:",null,"QUALIFICAÇÃO:"]
[]
["ASSINATURA:",null,null,"DATA:"]
[]
["OBSERVAÇAO:"]
["1 - DISCRIMINAR OS TRIBUTOS QUE INCIDEM SOBRE OS CUSTOS DA PRESTAÇÃO DOS SERVIÇOS"]
[]
["2 - DF = INDICAR O % DE CADA TRIBUTO E A SOMA DOS MESMOS (ex: ISS 5% + PIS 1,65% + COFINS 7,60% = 14,25%)"]
[]
["3 - AS DESPESAS FISCAIS (DF) INCIDEM SOBRE O TOTAL DA FATURA E NÃO SOBRE OS CUSTOS INCORRIDOS, DEVENDO SER CALCULADO O DF' APLICANDO-SE A SEGUINTE FÓRMULA:"]
[]
["     DF' = { [ 1 / ( 1 - DF) ] - 1 } x 100"]
["     DF' = { [ 1 / ( 1 - 0,1425 ) ] - 1 } x 100"]
["     DF' = 0,1662  ou  16,62%.  APLICAR O %  P/ CALCULAR AS DESPESAS FISCAIS"]
[]
["4 - O ISS a ser considerado é o do município de Salgueiro-PE"]

{"sheet":"Encargos Sociais","index":6,"n_rows":66,"n_cols":7,"rows_kept":66,"cut":false,"hidden":false,"merged":[[0,0,0,6],[49,0,49,3],[56,0,56,1],[9,2,9,3],[9,1,10,1],[9,0,10,0],[9,5,9,6],[43,0,43,1],[44,0,44,3],[45,0,45,1],[48,0,48,1],[12,0,12,1],[7,0,7,6],[4,0,5,6],[22,0,22,1],[23,0,23,3],[1,0,1,6],[65,0,66,0],[24,0,24,1],[35,0,35,1],[36,0,36,3],[37,0,37,1],[51,0,51,1],[52,0,52,1],[53,0,53,1],[54,0,54,1],[55,0,55,1],[59,4,59,6],[60,4,60,6],[61,4,61,6],[62,4,62,6],[59,0,59,3],[4,7,5,8],[63,0,63,6],[64,1,64,6],[65,1,66,6],[2,0,2,6],[60,0,60,3],[61,0,61,3],[62,0,62,3]]}
["Ministério do Desenvolvimento Regional - MDR\n"]
["Companhia de Desenvolvimento dos Vales do São Francisco e do Parnaíba\n"]
[]
[]
["CONTRATAÇÃO DE APOIO TÉCNICO PARA ACOMPANHAMENTO DAS ATIVIDADES DA GESTÃO DO PROJETO DE INTEGRAÇÃO DO RIO SÃO FRANCISCO COM AS BACIAS HIDROGRÁFICAS DO NORDESTE SETENTRIONAL – PISF"]
[]
[]
[" ENCARGOS SOCIAIS E TRABALHISTAS"]
[]
["ITEM","DESCRIÇÃO","DISTRITO FEDERAL",null,null,"PERNAMBUCO"]
[null,null,"Horista","Mensalista",null,"Horista","Mensalista"]
[]
["GRUPO \"A\"",null,"%","%",null,"%","%"]
["A1","INSS (Art. 22 inciso I da Lei 8.212/91) ",0.2,0.2,null,0.2,0.2]
["A2","SESC/SESI (Art. 3° da Lei 8036/90)",1.4999999999999999E-2,1.4999999999999999E-2,null,1.4999999999999999E-2,1.4999999999999999E-2]
["A3","SENAC/SENAI (Decreto 2.318/86)",0.01,0.01,null,0.01,0.01]
["A4","INCRA  (Lei 7787 de 30/06/890e DL 1146/70)",2E-3,2E-3,null,2E-3,2E-3]
["A5","SEBRAE (Art. 8° Lei 8029/90 e 8154 de 28/12/90)",6.0000000000000001E-3,6.0000000000000001E-3,null,6.0000000000000001E-3,6.0000000000000001E-3]
["A6","Salário Educação (Art. 3° inciso I Decreto 87.043/)",2.5000000000000001E-2,2.5000000000000001E-2,null,2.5000000000000001E-2,2.5000000000000001E-2]
["A7","Seguro contra Acidentes de Trabalho  (Decreto 3.048/1999, Anexo V e Decreto 6.957/2009)  ",0.03,0.03,null,0.03,0.03]
["A8","FGTS (Art. 15 da Lei 8030/90 art. 7° inciso III CF/88)",0.08,0.08,null,0.08,0.08]
["A8","SECONCI",0.01,0.01,null,"-","-"]
["TOTAL - Grupo A:",null,{"$f":"SUM(C14:C22)","v":0.37800000000000006},{"$f":"SUM(D14:D22)","v":0.37800000000000006},null,{"$f":"SUM(F14:F21)","v":0.36800000000000005},{"$f":"SUM(G14:G21)","v":0.36800000000000005}]
[]
["GRUPO \"B\"",null,"%","%",null,"%","%"]
["B1","Repouso semanal remunerado",0.1777,"-",null,0.18060000000000001,"-"]
["B2","Feriados",3.4099999999999998E-2,"-",null,4.3299999999999998E-2,"-"]
["B3","Auxílio Enfermidade",8.9999999999999993E-3,7.0000000000000001E-3,null,9.2999999999999992E-3,7.1000000000000004E-3]
["B4","13º Salário",0.1072,8.3299999999999999E-2,null,0.1086,8.3299999999999999E-2]
["B5","Licença Paternidade Faltas justificadas",5.9999999999999995E-4,5.0000000000000001E-4,null,6.9999999999999999E-4,5.9999999999999995E-4]
["B6","Faltas Justificadas",7.1000000000000004E-3,5.5999999999999999E-3,null,7.1999999999999998E-3,5.5999999999999999E-3]
["B7","Dias de Chuva",1.4200000000000001E-2,"-",null,2.18E-2,"-"]
["B8","Auxílio Acidente de Trabalho",1.1000000000000001E-3,8.0000000000000004E-4,null,1.1000000000000001E-3,8.9999999999999998E-4]
["B9","Férias Gozadas",8.1199999999999994E-2,6.3100000000000003E-2,null,7.6899999999999996E-2,5.8999999999999997E-2]
["B10","Salário Maternidade",2.9999999999999997E-4,2.0000000000000001E-4,null,2.9999999999999997E-4,2.0000000000000001E-4]
["TOTAL - Grupo B:",null,{"$f":"SUM(C26:C35)","v":0.4325},{"$f":"SUM(D26:D35)","v":0.1605},null,{"$f":"SUM(F26:F35)","v":0.44979999999999992},{"$f":"SUM(G26:G35)","v":0.15669999999999998}]
[]
["GRUPO \"C\"",null,"%","%",null,"%","%"]
["C1","Aviso Prévio Indenizado",5.1900000000000002E-2,4.0399999999999998E-2,null,4.8300000000000003E-2,3.7100000000000001E-2]
["C2","Aviso Prévio Trabalhado",1.1999999999999999E-3,1E-3,null,1.1000000000000001E-3,8.9999999999999998E-4]
{"$rows_left_out":27}
{"sheet":"Base de Preço (Salários)","index":7,"n_rows":56,"n_cols":13,"rows_kept":56,"cut":false,"hidden":false,"merged":[[9,2,9,3],[9,1,10,1],[9,0,10,0],[0,0,0,3],[1,0,1,3],[2,0,2,3],[4,0,5,3],[7,0,7,3],[55,0,55,3],[31,0,31,3],[33,0,34,0],[33,1,34,1],[33,2,33,3]]}
["Ministério do Desenvolvimento Regional - MDR\n"]
["Companhia de Desenvolvimento dos Vales do São Francisco e do Parnaíba\n"]
[]
[]
["CONTRATAÇÃO DE APOIO TÉCNICO PARA ACOMPANHAMENTO DAS ATIVIDADES DA GESTÃO DO PROJETO DE INTEGRAÇÃO DO RIO SÃO FRANCISCO COM AS BACIAS HIDROGRÁFICAS DO NORDESTE SETENTRIONAL – PISF"]
[]
[]
["MEMORIAL DE CÁLCULO - SALÁRIOS - Pernambuco"]
[]
["Categoria","Profissional","Salário"]
[null,null,"Hora","Mensal"]
["C","Categoria Profissional adotado Sal. Mensal (R$) Sociais c/ Encargos Sociais",null,{"$f":"C12*176","v":0}]
["P0","Engenheiro - Profissional Sênior (N. Superior - Formação: T > 15 anos)",null,{"$f":"C13*176","v":0}]
["P1","Engenheiro - Profissional Pleno (N. Superior - Formação: 10 < T < 15 anos)",null,0]
["P2","Engenheiro - Profissional Médio (N. Superior - Formação: 8 < T < 10 anos)",null,0]
["P3","Engenheiro - Profissional Junior (N. Superior - Formação: 4 < T < 8 anos)",null,0]
["P4","Engenheiro - Profissional Trainee (N. Superior - Formação: T < 4 anos)",null,0]
["TS","Técnico - Profissional Especials (N. Médio/Especializado - Formação: T > 10 anos)",null,0]
["T0","Técnico - Profissional Sênior (N. Médio/Especializado - Formação: 5 < T < 10 anos)",null,0]
["T1","Técnico - Profissional Pleno (N. Médio/Especializado - Formação: 5 < 10 < anos)",null,0]
["T2","Técnico - Profissional Junior (N. Médio/Especializado - Formação: T < 5 anos)",null,0]
["T3","Técnico - Auxiliar (N. Elementar)",null,0]
["T4","Servente / Contínuos",null,0]
["AS","Chefe de Escritório (Nível Superior - Formação: T > 15 anos)",null,0]
["A0","Secretária (N. Médio - Formação: 8 < T < 15 anos)",null,0]
["A1","Assistente Administrativo (N. Médio - Formação:  T > 8 anos)",null,0]
["A2","Ajudante Administrativo (N. Médio - Formação:  T < 8 anos)",null,0]
["A3","Auxiliar Administrativo / Motorista  (N. Elementar)",null,0]
["A4","Serviços Gerais / Vigia (N. Elementar)",null,0]
["A4.1","Serviços Gerais / Vigia (N. Elementar) - NOTURNO",null,{"$f":"C30*176","v":0}]
[{"$nulls":12}," "]
["MEMORIAL DE CÁLCULO - SALÁRIOS - Distrito Federal"]
[]
["Categoria","Profissional","Salário"]
[null,null,"Hora","Mensal"]
["C","Categoria Profissional adotado Sal. Mensal (R$) Sociais c/ Encargos Sociais",null,{"$f":"C36*176","v":0}]
["P0","Engenheiro - Profissional Sênior (N. Superior - Formação: T > 15 anos)",null,{"$f":"C37*176","v":0}]
["P1","Engenheiro - Profissional Pleno (N. Superior - Formação: 10 < T < 15 anos)",null,0]
["P2","Engenheiro - Profissional Médio (N. Superior - Formação: 8 < T < 10 anos)",null,0]
["P3","Engenheiro - Profissional Junior (N. Superior - Formação: 4 < T < 8 anos)",null,0]
{"$rows_left_out":16}