{"text_format":"2","workbook":"xlsx","n_sheets":9,"sheets":["Motobomba","Reservatórios","Tubos e conexões","Material elétrico","Hidrômetro","Tubo em concreto","Clorador","Média de preços","Quadro Final"],"not_rendered":{"charts":0,"images":1,"macros":0,"external_links":0,"defined_names":11,"comments":1,"pivot_tables":0},"unopened":[],"bounds":{"document_bytes":16777216,"sheet_cells":100000,"run_cost":"one","rows_first":2000,"rows_last":500,"rows_between":2000,"halvings":0,"cell_chars":16384,"cell_head_chars":4096},"cells_cut":0,"cells_raw":0,"read":"whole","date_system":"1900"}

{"sheet":"Motobomba","index":0,"n_rows":31,"n_cols":11,"rows_kept":31,"cut":false,"hidden":false,"merged":[[24,8,24,10],[25,7,26,7],[27,8,27,10],[19,7,20,7],[22,7,23,7],[21,8,21,10],[18,8,18,10],[6,8,6,10],[9,8,9,10],[12,8,12,10],[15,8,15,10],[13,7,14,7],[16,7,17,7],[4,7,5,7],[7,7,8,7],[10,7,11,7],[43,0,43,6],[56,0,56,4],[42,0,42,4],[44,0,45,0],[44,1,45,1],[44,2,45,2],[44,3,45,3],[44,4,44,5],[25,0,27,0],[10,0,12,0],[13,0,15,0],[0,0,0,6],[30,0,31,0],[30,1,31,1],[30,2,31,2],[30,3,31,3],[30,4,30,5],[1,0,1,6],[29,0,29,6],[28,0,28,4],[2,0,3,0],[2,1,3,1],[2,2,3,2],[2,3,3,3],[2,4,2,5],[4,0,6,0],[7,0,9,0],[16,0,18,0],[19,0,21,0],[4,3,6,3],[7,3,9,3],[10,3,12,3],[13,3,15,3],[16,3,18,3],[19,3,21,3],[22,0,24,0],[4,1,6,1],[7,1,9,1],[10,1,12,1],[13,1,15,1],[16,1,18,1],[19,1,21,1],[22,1,24,1],[22,3,24,3],[25,3,27,3],[25,1,27,1],[4,2,6,2],[7,2,9,2],[10,2,12,2],[13,2,15,2],[16,2,18,2],[19,2,21,2],[22,2,24,2],[25,2,27,2]]}
["SISTEMA DE REGISTRO DE PREÇOS - 2018"]
["I – CONJUNTO MOTOBOMBA E CHAVE DE PROTEÇÃO E PARTIDA    "]
["ITEM","DESCRIÇÃO DOS MATERIAIS","UNID.","CONSUMO ANUAL","PREÇOS MÁXIMOS (R$)"]
[{"$nulls":4},"UNITARIO","TOTAL","Fonte"]
[1,"CONJUNTO MOTOBOMBA SUBMERSA E CHAVE DE PROTEÇÃO E PARTIDA: MOTOBOMBA SUBMERSA ELÉTRICA, PARA ATENDER UMA VAZÃO MÍNIMA DE 4M3/H E ALTURA MANOMÉTRICA (HMAN) DE 92 MCA, POTÊNCIA MÁXIMA DE 03 (TRÊS) C.V. , MONOFÁSICA, 220 VOLTS E 60 HZ."," UN ",200,3350,{"$f":"E5*D5","v":670000},"VEMAPE                                                                                  (38) 3690-9000                       CNPJ: 05.150.060/0001-04.",null,"V1","V2","V3"]
[{"$nulls":4},2160,{"$f":"D5*E6","v":432000},"BRASIDAS - EIRELI                       (47) 3057-3920                                   CNPJ 20.483.193/0001-96",null,{"$f":"E5","v":3350},{"$f":"E6","v":2160},{"$f":"E7","v":2480}]
[{"$nulls":4},2480,{"$f":"E7*D5","v":496000},"SÓ BOMBAS                                        (38) 3212-8989                      CNPJ: 26.078.493.0001-76","Média item 1",{"$f":"(I6+J6+K6)/3","v":2663.3333333333335}]
[2,"CONJUNTO MOTOBOMBA SUBMERSA E CHAVE DE PROTEÇÃO E PARTIDA: MOTOBOMBA SUBMERSA ELÉTRICA, PARA ATENDER UMA VAZÃO MÍNIMA DE 8M3/H E ALTURA MANOMÉTRICA (HMAN) DE 92 MCA, POTÊNCIA MÁXIMA DE 05 (CINCO) C.V. , MONOFÁSICA, 220 VOLTS E 60 HZ."," UN ",100,5100,{"$f":"E8*D8","v":510000},"VEMAPE                                                                                  (38) 3690-9000                       CNPJ: 05.150.060/0001-04.",null,"V1","V2","V3"]
[{"$nulls":4},5581,{"$f":"D8*E9","v":558100},"BRASIDAS - EIRELI                       (47) 3057-3920                                   CNPJ 20.483.193/0001-96",null,{"$f":"E8","v":5100},{"$f":"E9","v":5581},{"$f":"E10","v":4500}]
[{"$nulls":4},4500,{"$f":"E10*D8","v":450000},"SÓ BOMBAS                                        (38) 3212-8989                      CNPJ: 26.078.493.0001-76","Média item 2",{"$f":"(I9+J9+K9)/3","v":5060.333333333333}]
[3,"MOTOBOMBA CENTRIFUGA ACOPLADA AO MOTOR A GASOLINA 2,8 CV 4 TEMPOS  COM VAZÃO 16000 L/H E HM = 45 MCA INCLUINDO MANGOTE COM 6M DE COMPRIMENTO, VÁLVULA DE PÉ COM CRIVO, DUAS ABRAÇADEIRAS E DUAS CURVAS DE AÇO"," UN ",10,1300,{"$f":"E11*D11","v":13000},"VEMAPE                                                                                  (38) 3690-9000                       CNPJ: 05.150.060/0001-04.",null,"V1","V2","V3"]
[{"$nulls":4},1250,{"$f":"D11*E12","v":12500},"BRASIDAS - EIRELI                       (47) 3057-3920                                   CNPJ 20.483.193/0001-96",null,{"$f":"E11","v":1300},{"$f":"E12","v":1250},{"$f":"E13","v":1125}]
[{"$nulls":4},1125,{"$f":"E13*D11","v":11250},"SÓ BOMBAS                                        (38) 3212-8989                      CNPJ: 26.078.493.0001-76","Média item 3",{"$f":"(I12+J12+K12)/3","v":1225}]
[4,"MOTOBOMBA CENTRIFUGA ACOPLADA AO MOTOR A GASOLINA 5,5 CV 4 TEMPOS  COM VAZÃO 20000 L/H E HM = 38 MCA  INCLUINDO MANGOTE COM 6M DE COMPRIMENTO, VÁLVULA DE PÉ COM CRIVO, DUAS ABRAÇADEIRAS E DUAS CURVAS DE AÇO"," UN ",10,1650,{"$f":"E14*D14","v":16500},"VEMAPE                                                                                  (38) 3690-9000                       CNPJ: 05.150.060/0001-04.",null,"V1","V2","V3"]
[{"$nulls":4},2180,{"$f":"D14*E15","v":21800},"BRASIDAS - EIRELI                       (47) 3057-3920                                   CNPJ 20.483.193/0001-96",null,{"$f":"E14","v":1650},{"$f":"E15","v":2180},{"$f":"E16","v":1498}]
[{"$nulls":4},1498,{"$f":"E16*D14","v":14980},"SÓ BOMBAS                                        (38) 3212-8989                      CNPJ: 26.078.493.0001-76","Média item 4",{"$f":"(I15+J15+K15)/3","v":1776}]
[5,"MOTOBOMBA CENTRIFUGA ACOPLADA AO MOTOR A GASOLINA 6,5 CV 4 TEMPOS  COM VAZÃO 36000 L/H E HM = 56 MCA  INCLUINDO MANGOTE COM 6M DE COMPRIMENTO, VÁLVULA DE PÉ COM CRIVO, DUAS ABRAÇADEIRAS E DUAS CURVAS DE AÇO"," UN ",10,1650,{"$f":"E17*D17","v":16500},"VEMAPE                                                                                  (38) 3690-9000                       CNPJ: 05.150.060/0001-04.",null,"V1","V2","V3"]
[{"$nulls":4},1980,{"$f":"D17*E18","v":19800},"BRASIDAS - EIRELI                       (47) 3057-3920                                   CNPJ 20.483.193/0001-96",null,{"$f":"E17","v":1650},{"$f":"E18","v":1980},{"$f":"E19","v":1550}]
[{"$nulls":4},1550,{"$f":"E19*D17","v":15500},"SÓ BOMBAS                                        (38) 3212-8989                      CNPJ: 26.078.493.0001-76","Média item 5",{"$f":"(I18+J18+K18)/3","v":1726.6666666666667}]
[6,"MOTOBOMBA CENTRÍFUGA  DE EIXO HORIZONTAL, POTÊNCIA MÁXIMA 3CV, ROTOR EM BRONZE COM VAZÃO 5.000 L/H E HM = 100 MCA MONOFÁSICO  INCLUINDO MANGOTE COM 6M DE COMPRIMENTO, VÁLVULA DE PÉ COM CRIVO, DUAS ABRAÇADEIRAS E DUAS CURVAS DE AÇO"," UN ",10,3400,{"$f":"E20*D20","v":34000},"VEMAPE                                                                                  (38) 3690-9002                       CNPJ: 05.150.060/0001-04.",null,"V1","V2","V3"]
[{"$nulls":4},3507,{"$f":"D20*E21","v":35070},"BRASIDAS - EIRELI                       (47) 3057-3920                                   CNPJ 20.483.193/0001-96",null,{"$f":"E20","v":3400},{"$f":"E21","v":3507},{"$f":"E22","v":3800}]
[{"$nulls":4},3800,{"$f":"E22*D20","v":38000},"SÓ BOMBAS                                        (38) 3690-9100                      CNPJ: 01.427.458/0001-94","Média item 6",{"$f":"(I21+J21+K21)/3","v":3569}]
[7,"MOTOBOMBA CENTRÍFUGA  DE EIXO HORIZONTAL, POTÊNCIA MÁXIMA 5CV, ROTOR EM BRONZE COM VAZÃO 10.000 L/H E HM = 80 MCA MONOFÁSICO INCLUINDO MANGOTE COM 6M DE COMPRIMENTO, VÁLVULA DE PÉ COM CRIVO, DUAS ABRAÇADEIRAS E DUAS CURVAS DE AÇO"," UN ",10,6600,{"$f":"E23*D23","v":66000},"VEMAPE                                                                                  (38) 3690-9000                       CNPJ: 05.150.060/0001-04.",null,"V1","V2","V3"]
[{"$nulls":4},6408,{"$f":"D23*E24","v":64080},"BRASIDAS - EIRELI                       (47) 3057-3920                                   CNPJ 20.483.193/0001-96",null,{"$f":"E23","v":6600},{"$f":"E24","v":6408},{"$f":"E25","v":6100}]
[{"$nulls":4},6100,{"$f":"E25*D23","v":61000},"SÓ BOMBAS                                        (38) 3212-8989                      CNPJ: 26.078.493.0001-76","Média item 7",{"$f":"(I24+J24+K24)/3","v":6369.333333333333}]
[8,"MOTOBOMBA CENTRÍFUGA  DE EIXO HORIZONTAL, POTÊNCIA MÁXIMA 7,5 CV, ROTOR EM BRONZE COM VAZÃO 10.000 L/H E HM = 100 MCA MONOFÁSICO INCLUINDO MANGOTE COM 6M DE COMPRIMENTO, VÁLVULA DE PÉ COM CRIVO, DUAS ABRAÇADEIRAS E DUAS CURVAS DE AÇO"," UN ",10,7900,{"$f":"E26*D26","v":79000},"VEMAPE                                                                                  (38) 3690-9002                       CNPJ: 05.150.060/0001-04.",null,"V1","V2","V3"]
[{"$nulls":4},8897,{"$f":"D26*E27","v":88970},"BRASIDAS - EIRELI                       (47) 3057-3920                                   CNPJ 20.483.193/0001-96",null,{"$f":"E26","v":7900},{"$f":"E27","v":8897},{"$f":"E28","v":8600}]
[{"$nulls":4},8600,{"$f":"E28*D26","v":86000},"SÓ BOMBAS                                        (38) 3212-8989                      CNPJ: 26.078.493.0001-76","Média item 8",{"$f":"(I27+J27+K27)/3","v":8465.6666666666661}]
[]
[]
[{"$nulls":4}," "]

{"sheet":"Reservatórios","index":1,"n_rows":21,"n_cols":11,"rows_kept":21,"cut":false,"hidden":false,"merged":[[11,8,11,10],[3,7,4,7],[5,8,5,10],[6,7,7,7],[8,8,8,10],[9,7,10,7],[26,0,26,4],[19,0,19,4],[20,0,20,5],[21,0,22,0],[21,1,22,1],[21,2,22,2],[21,3,22,3],[21,4,21,5],[0,0,0,6],[12,0,12,4],[13,0,13,5],[14,0,15,0],[14,1,15,1],[14,2,15,2],[14,3,15,3],[14,4,14,5],[1,0,2,0],[1,1,2,1],[1,2,2,2],[1,3,2,3],[1,4,1,5],[6,3,8,3],[9,3,11,3],[3,0,5,0],[3,2,5,2],[6,2,8,2],[9,2,11,2],[3,3,5,3],[6,0,8,0],[9,0,11,0],[3,1,5,1],[6,1,8,1],[9,1,11,1]]}
["II – RESERVATÓRIOS"]
["ITEM","DESCRIÇÃO DOS MATERIAIS","UNID.","CONSUMO ANUAL","PREÇOS MÁXIMOS (R$)"]
[{"$nulls":4},"UNITARIO","TOTAL","Fonte"]
[9,"RESERVATÓRIO DE POLIETILENO FECHAMENTO RÁPIDO E SEGURO, TAMPA ROSCÁVEL, OLHAIS PARA IÇAMENTO E ANCORAMENTO NA BORDA, DESTINADO A ARMAZENAGEM DE ÁGUA POTÁVEL, ATÓXICO, COM CAPACIDADE DE ARMAZENAMENTO DE 5 M3, COM ORIFICIOS PARA ENTRADA DE 1 ½ POLEGADA E SAIDA DE 1 ½ POLEGADA DE ÁGUA.","UN",180,1300,{"$f":"E4*D4","v":234000},"USINORTE POLIETILENO                Fone: (38) 3214-7387                       CNPJ: 09.607.249/0001-34",null,"V1","V2","V3"]
[{"$nulls":4},1423,{"$f":"E5*D4","v":256140},"FIBRATEC ENGENHARIA                     (49) 3321-3333                               CNPJ: 79.915.955/0001-29",null,{"$f":"E4","v":1300},{"$f":"E5","v":1423},{"$f":"E6","v":2350}]
[{"$nulls":4},2350,{"$f":"E6*D4","v":423000},"VEMAPE                                                                                  (38) 3690-9002                       CNPJ: 05.150.060/0001-04.","Média item 11",{"$f":"(I5+J5+K5)/3","v":1691}]
[10,"RESERVATÓRIO DE POLIETILENO FECHAMENTO RÁPIDO E SEGURO, TAMPA ROSCÁVEL, OLHAIS PARA IÇAMENTO E ANCORAMENTO NA BORDA, DESTINADO A ARMAZENAGEM DE ÁGUA POTÁVEL, ATÓXICO, COM CAPACIDADE DE ARMAZENAMENTO DE 10 M3, COM ORIFICIOS PARA ENTRADA DE 1 ½ POLEGADA E SAIDA DE 1 ½ POLEGADA DE ÁGUA.","UN",200,2300,{"$f":"E7*D7","v":460000},"USINORTE POLIETILENO                Fone: (38) 3214-7387                       CNPJ: 09.607.249/0001-34",null,"V1","V2","V3"]
[{"$nulls":4},2614,{"$f":"E8*D7","v":522800},"Fibratec Engenharia                       (49) 3321-3333                               CNPJ: 79.915.955/0001-29",null,{"$f":"E7","v":2300},{"$f":"E8","v":2614},{"$f":"E9","v":3900}]
[{"$nulls":4},3900,{"$f":"E9*D7","v":780000},"VEMAPE                                                                                  (38) 3690-9002                       CNPJ: 05.150.060/0001-04.","Média item 12",{"$f":"(I8+J8+K8)/3","v":2938}]
[11,"RESERVATÓRIO DE POLIETILENO FECHAMENTO RÁPIDO E SEGURO, TAMPA ROSCÁVEL, OLHAIS PARA IÇAMENTO E ANCORAMENTO NA BORDA, DESTINADO A ARMAZENAGEM DE ÁGUA POTÁVEL, ATÓXICO, COM CAPACIDADE DE ARMAZENAMENTO DE 15 M3, COM ORIFICIOS PARA ENTRADA DE 1 ½ POLEGADA E SAIDA DE 1 ½ POLEGADA DE ÁGUA.","UN",40,4100,{"$f":"E10*D10","v":164000},"USINORTE POLIETILENO                Fone: (38) 3214-7387                       CNPJ: 09.607.249/0001-34",null,"V1","V2","V3"]
[{"$nulls":4},3998,{"$f":"E11*D10","v":159920},"Fibratec Engenharia                       (49) 3321-3333                               CNPJ: 79.915.955/0001-29",null,{"$f":"E10","v":4100},{"$f":"E11","v":3998},{"$f":"E12","v":6850}]
[{"$nulls":4},6850,{"$f":"E12*D10","v":274000},"VEMAPE                                                                                  (38) 3690-9002                       CNPJ: 05.150.060/0001-04.","Média item 13",{"$f":"(I11+J11+K11)/3","v":4982.666666666667}]
{"$rows_empty":8}
["                                                                                                                                                                                                                                                                                                                                                                                                                                                                                                                                                                                                                                                                                                                                                                                                                        "]

{"sheet":"Tubos e conexões","index":2,"n_rows":35,"n_cols":15,"rows_kept":35,"cut":false,"hidden":false,"merged":[[20,8,20,10],[12,7,13,7],[14,8,14,10],[15,7,16,7],[17,8,17,10],[18,7,19,7],[3,7,4,7],[5,8,5,10],[6,7,7,7],[8,8,8,10],[11,8,11,10],[9,7,10,7],[27,7,28,7],[0,0,0,6],[25,0,25,4],[27,0,28,0],[27,1,28,1],[27,2,28,2],[27,3,28,3],[27,4,27,5],[26,0,26,6],[1,0,2,0],[1,1,2,1],[1,2,2,2],[1,3,2,3],[1,4,1,5],[3,0,5,0],[6,0,8,0],[9,0,11,0],[12,0,14,0],[15,0,17,0],[18,0,20,0],[45,0,45,4],[35,0,35,4],[37,0,38,0],[37,1,38,1],[37,2,38,2],[37,3,38,3],[37,4,37,5],[36,0,36,6],[18,1,20,1],[15,2,17,2],[18,2,20,2],[15,3,17,3],[3,1,5,1],[6,1,8,1],[9,1,11,1],[12,1,14,1],[15,1,17,1],[18,3,20,3],[3,2,5,2],[3,3,5,3],[6,2,8,2],[6,3,8,3],[9,2,11,2],[9,3,11,3],[12,2,14,2],[12,3,14,3]]}
["III –  TUBOS E CONEXÕES"]
["ITEM","DESCRIÇÃO DOS MATERIAIS","UNID.","CONSUMO ANUAL","PREÇOS MÁXIMOS (R$)"]
[{"$nulls":4},"UNITARIO","TOTAL","Fonte"]
[12,"TUBO DE PVC, PN 60, SOLDÁVEL, PONTA E BOLSA, COMPRIMENTO 6M, DE-25MM - NBR 14654","UN",30000,10.1,{"$f":"E4*D4","v":303000},"UNOCANN TUBOS E CONEXÕES (31) 3503-5500 CNPJ: 86.632.239/0001-08",null,"V1","V2","V3"]
[{"$nulls":4},7.29,{"$f":"D4*E5","v":218700},"POLYVIN PLÁSTICOS E DERIVADO LTDA                              (34) 3319-1700                            CNPJ: 41.664.871/0001-97",null,{"$f":"E4","v":10.1},{"$f":"E5","v":7.29},{"$f":"E6","v":8.5}]
[{"$nulls":4},8.5,{"$f":"E6*D4","v":255000},"VEMAPE                                                                                  (38) 3690-9002                       CNPJ: 05.150.060/0001-04.","Média item 14",{"$f":"(I5+J5+K5)/3","v":8.6300000000000008},null,null,null,{"$f":"I6","v":8.6300000000000008}]
[13,"TUBO DE PVC, PN 60, SOLDÁVEL, PONTA E BOLSA, COMPRIMENTO 6M, DN-32MM - NBR 14654","UN",30000,18.899999999999999,{"$f":"E7*D7","v":567000},"UNOCANN TUBOS E CONEXÕES (31) 3503-5500 CNPJ: 86.632.239/0001-08",null,"V1","V2","V3"]
[{"$nulls":4},11.34,{"$f":"D7*E8","v":340200},"POLYVIN PLÁSTICOS E DERIVADO LTDA                              (34) 3319-1700                            CNPJ: 41.664.871/0001-97",null,{"$f":"E7","v":18.899999999999999},{"$f":"E8","v":11.34},{"$f":"E9","v":13.9}]
[{"$nulls":4},13.9,{"$f":"E9*D7","v":417000},"VEMAPE                                                                                  (38) 3690-9002                       CNPJ: 05.150.060/0001-04.","Média item 15",{"$f":"(I8+J8+K8)/3","v":14.713333333333333},null,null,null,{"$f":"I9","v":14.713333333333333}]
[14,"TUBO DE PVC, PN 80, SOLDÁVEL, PONTA E BOLSA, COMPRIMENTO 6M, DN-50MM - NBR 14312","UN",180000,38.9,{"$f":"E10*D10","v":7002000},"UNOCANN TUBOS E CONEXÕES (31) 3503-5500 CNPJ: 86.632.239/0001-08",null,"V1","V2","V3"]
[{"$nulls":4},23.09,{"$f":"D10*E11","v":4156200},"POLYVIN PLÁSTICOS E DERIVADO LTDA                              (34) 3319-1700                            CNPJ: 41.664.871/0001-97",null,{"$f":"E10","v":38.9},{"$f":"E11","v":23.09},{"$f":"E12","v":28}]
[{"$nulls":4},28,{"$f":"E12*D10","v":5040000},"VEMAPE                                                                                  (38) 3690-9002                       CNPJ: 05.150.060/0001-04.","Média item 16",{"$f":"(I11+J11+K11)/3","v":29.996666666666666},null,null,null,{"$f":"I12","v":29.996666666666666}]
[15,"TUBO GALVANIZADO COM ROSCA BSP E LUVA, DN 1 ¹/² \", PN 15 Kgf / cm², CLASSE M - NBR 5580","UN",1000,162,{"$f":"E13*D13","v":162000}," Tubos Ipiranga                                  (31) 3388-5999                         CNPJ: 01.477.885/0004-20",null,"V1","V2","V3"]
[{"$nulls":4},160,{"$f":"E14*D13","v":160000},"VEMAPE                                                                                  (38) 3690-9002                       CNPJ: 05.150.060/0001-04.",null,{"$f":"E13","v":162},{"$f":"E14","v":160},{"$f":"E15","v":181.3}]
[{"$nulls":4},181.3,{"$f":"E15*D13","v":181300},"QUALITY TUBOS                    (11) 2597-5710                    CNPJ 11818296000179","Média item 17",{"$f":"(I14+J14+K14)/3","v":167.76666666666668},null,null,null,{"$f":"I15","v":167.76666666666668}]
[16,"TUBO DE PVC PBA, CLASSE 15, JUNTA ELASTICA, REDE AGUA, COMPRIMENTO 6M, DN-75MM - NBR ","UN",2000,177,{"$f":"E16*D16","v":354000},"VEMAPE                                                                                  (38) 3690-9000                       CNPJ: 05.150.060/0001-04.",null,"V1","V2","V3"]
[{"$nulls":4},101.45,{"$f":"E17*D16","v":202900},"UNOCANN TUBOS E CONEXÕES (31) 3503-5500 CNPJ: 86.632.239/0001-08",null,{"$f":"E16","v":177},{"$f":"E17","v":101.45},{"$f":"E18","v":99.9}]
[{"$nulls":4},99.9,{"$f":"D16*E18","v":199800},"POLYVIN PLÁSTICOS E DERIVADO LTDA                              (34) 3319-1700                            CNPJ: 41.664.871/0001-97","Média item 18",{"$f":"(I17+J17+K17)/3","v":126.11666666666667},null,null,null,{"$f":"I18","v":126.11666666666667}]
[17,"TUBO DE PVC PBA, CLASSE 15, JUNTA ELASTICA, REDE AGUA, COMPRIMENTO 6M, DN-100MM - NBR","UN",2000,298,{"$f":"E19*D19","v":596000},"VEMAPE                                                                                  (38) 3690-9000                       CNPJ: 05.150.060/0001-04.",null,"V1","V2","V3"]
[{"$nulls":4},164.2,{"$f":"E20*D19","v":328400},"UNOCANN TUBOS E CONEXÕES (31) 3503-5500 CNPJ: 86.632.239/0001-08",null,{"$f":"E19","v":298},{"$f":"E20","v":164.2},{"$f":"E21","v":164.91}]
[{"$nulls":4},164.91,{"$f":"D19*E21","v":329820},"POLYVIN PLÁSTICOS E DERIVADO LTDA                              (34) 3319-1700                            CNPJ: 41.664.871/0001-97","Média item 19",{"$f":"(I20+J20+K20)/3","v":209.03666666666666},null,null,null,{"$f":"I21","v":209.03666666666666}]
[]
[]
[]
[]
[]
[{"$nulls":11},15]
[]
[{"$nulls":14},{"$f":"AVERAGE(I27:K27)","v":{"$error":"#DIV/0!"}}]
[14,{"$f":"D4","v":30000},{"$nulls":4},"Moales                                                      (38) 99121-0956"]
[15,{"$f":"D7","v":30000}]
[16,{"$f":"D10","v":180000}]
[17,{"$f":"D13","v":1000}]
[18,{"$f":"D16","v":2000}]
[19,{"$f":"D19","v":2000}]

{"sheet":"Material elétrico","index":3,"n_rows":14,"n_cols":13,"rows_kept":14,"cut":false,"hidden":true,"merged":[[5,8,5,10],[6,7,7,7],[8,8,8,10],[3,7,4,7],[24,2,24,3],[26,2,26,3],[9,0,9,4],[16,0,16,4],[1,4,1,5],[11,0,12,0],[11,1,12,1],[11,2,12,2],[11,3,12,3],[11,4,11,5],[17,0,17,6],[10,0,10,6],[3,2,5,2],[6,2,8,2],[3,3,5,3],[6,3,8,3],[0,0,0,6],[21,0,21,4],[1,0,2,0],[1,1,2,1],[1,2,2,2],[1,3,2,3],[14,0,14,4],[18,0,19,0],[18,1,19,1],[18,2,19,2],[18,3,19,3],[18,4,18,5],[3,0,5,0],[6,0,8,0],[6,1,8,1],[3,1,5,1]]}
["IV –  MATERIAL ELÉTRICO "]
["ITEM","DESCRIÇÃO DOS MATERIAIS","UNID.","CONSUMO ANUAL","PREÇOS MÁXIMOS (R$)"]
[{"$nulls":4},"UNITARIO","TOTAL","Fonte"]
[18,"CABO TRIPOLAR DE 3x10mm, SISTEMA FLEXÍVEL, 1.000v","M",2000,15.53,{"$f":"E4*D4","v":31060},"Ponto do eletricista                                                                    (31) 3244-6000                                                                CNPJ 17.192.774/0001-64",null,"V1","V2","V3"]
[{"$nulls":4},10.199999999999999,{"$f":"E5*D4","v":20400},"Disnacon - Aberlado -                            (11) 2061- 8461                                                             CNPJ 2416925000143",null,{"$f":"E4","v":15.53},{"$f":"E5","v":10.199999999999999},{"$f":"E6","v":12.91},null,{"$f":"I6","v":12.88}]
[{"$nulls":4},12.91,{"$f":"E6*D4","v":25820},"Othon de Carvalho                               (31) 2103 - 3000                               CNPJ 17.185.679/0001-33","Média item 20",{"$f":"(I5+J5+K5)/3","v":12.88}]
[19,"FIO ENCAPADO 10mm","M",2000,4.55,{"$f":"E7*D7","v":9100},"Ponto do eletricista                                                                    (31) 3244-6000                                                                CNPJ 17.192.774/0001-64",null,"V1","V2","V3"]
[{"$nulls":4},3,{"$f":"E8*D7","v":6000},"VEMAPE                                                                                  (38) 3690-9002                                CNPJ: 05.150.060/0001-04.",null,{"$f":"E7","v":4.55},{"$f":"E8","v":3},{"$f":"E9","v":3.27}]
[{"$nulls":4},3.27,{"$f":"E9*D7","v":6540},"Synergy Cables                                       (31) 3271-6360                                   CNPJ. 10.406.752/0001-00","Média item 21",{"$f":"(I8+J8+K8)/3","v":3.6066666666666669},null,null,null,{"$f":"I9","v":3.6066666666666669}]
[]
[]
[]
[{"$nulls":4},{"$f":"D4","v":2000}]
[{"$nulls":4},{"$f":"D7","v":2000}]

{"sheet":"Hidrômetro","index":4,"n_rows":16,"n_cols":18,"rows_kept":16,"cut":false,"hidden":true,"merged":[[5,8,5,10],[3,7,4,7],[3,2,5,2],[3,3,5,3],[8,4,8,5],[0,0,0,6],[1,0,2,0],[1,1,2,1],[1,2,2,2],[1,3,2,3],[1,4,1,5],[3,0,5,0],[6,0,6,4],[7,0,7,6],[8,0,9,0],[16,0,16,4],[11,0,11,4],[12,0,12,6],[13,0,14,0],[13,1,14,1],[13,2,14,2],[13,3,14,3],[13,4,13,5],[8,1,9,1],[8,2,9,2],[8,3,9,3],[3,1,5,1]]}
["V – HIDRÔMETRO "]
["ITEM","DESCRIÇÃO DOS MATERIAIS","UNID.","QUANT.","PREÇOS MÁXIMOS (R$)"]
[{"$nulls":4},"UNITARIO","TOTAL","Fonte"]
[20,"HIDRÔMETRO 3/4\" COM VAZÃO = 1,5 M³ CONFORME NBR 8009, 8193 A 8195 DA ABNT, INCLUSO VIROLAS E CAVALETE"," UN ",2000,{"$f":"73.2+33","v":106.2},{"$f":"E4*D4","v":212400},"     IRMÃOS SAFALTIS             (11) 3312-8544              CNPJ: 60.418.480/0001-37",null,"V1","V2","V3"]
[{"$nulls":4},{"$f":"92+33","v":125},{"$f":"E5*D4","v":250000},"VEMAPE                                                                                  (38) 3690-9000                       CNPJ: 05.150.060/0001-04.",null,{"$f":"E4","v":106.2},{"$f":"E5","v":125},{"$f":"E6","v":101}]
[{"$nulls":4},{"$f":"68+33","v":101},{"$f":"E6*D4","v":202000},"RMC Hidrômetros              (38) 3214-5875                  CNPJ: 13.802.300/0001-36","Média item 22",{"$f":"(I5+J5+K5)/3","v":110.73333333333333},null,null,null,{"$f":"I6","v":110.73333333333333}]
[]
[]
[]
[{"$nulls":8},35,87]
[]
[]
[{"$nulls":12},"m",400,12000,null,{"$f":"(N13/O13)*100","v":3.3333333333333335},"%"]
[{"$nulls":12},"c",1600,3200,null,50,"%"]
[{"$nulls":12},"ps",100,1100,null,9.0909090909090917,"%"]
[{"$nulls":12},"h",10,15000,null,{"$f":"(N16/O16)*100","v":6.6666666666666666E-2},"%"]

{"sheet":"Tubo em concreto","index":5,"n_rows":12,"n_cols":12,"rows_kept":12,"cut":false,"hidden":true,"merged":[[0,0,0,6],[1,0,1,6],[2,0,3,0],[2,1,3,1],[2,2,3,2],[2,3,3,3],[2,4,2,5],[4,0,6,0],[4,1,6,1],[4,2,6,2],[4,3,6,3],[4,7,5,7],[17,0,17,4],[6,8,6,9],[12,0,12,4],[13,0,13,6],[14,0,15,0],[14,1,15,1],[14,2,15,2],[14,3,15,3],[14,4,14,5],[7,0,7,4],[8,0,8,6],[9,0,10,0],[9,1,10,1],[9,2,10,2],[9,3,10,3],[9,4,9,5]]}
["                                                               COTAÇÃO TUBO DE CONCRETO                                                                "]
["VI – TUBO DE CONCRETO "]
["ITEM","DESCRIÇÃO DOS MATERIAIS","UNID.","QUANT.","PREÇOS MÁXIMOS (R$)"]
[{"$nulls":4},"UNITARIO","TOTAL","Fonte"]
[21,"TUBO CONCRETO ARMADO, CLASSE PA-2, PB, DN 1000 MM, PARA AGUAS PLUVIAIS (NBR8890)"," UN ",500,212.33,{"$f":"E5*D5","v":106165},"     SINAPI    7765                       FEV 2018",null,"V1","V2"]
[{"$nulls":4},275,{"$f":"E6*D5","v":137500},"Premoblocos\nCnpj: 05093732/0001-97    (38) 3224-4300\n",null,{"$f":"E5","v":212.33},{"$f":"E6","v":275}]
[{"$nulls":7},"Média item 23",{"$f":"(I6+J6)/2","v":243.66500000000002},null,null,{"$f":"I7","v":243.66500000000002}]
[]
[]
[]
[]
[null,null,null,{"$f":"D5","v":500}]

{"sheet":"Clorador","index":6,"n_rows":17,"n_cols":13,"rows_kept":17,"cut":false,"hidden":true,"merged":[[15,0,15,4],[10,0,10,4],[11,0,11,6],[12,0,13,0],[12,1,13,1],[12,2,13,2],[12,3,13,3],[12,4,12,5],[6,0,6,6],[7,0,8,0],[7,1,8,1],[7,2,8,2],[7,3,8,3],[7,4,7,5],[5,8,5,10],[0,0,0,6],[1,0,2,0],[1,1,2,1],[1,2,2,2],[1,3,2,3],[1,4,1,5],[3,0,5,0],[3,1,5,1],[3,2,5,2],[3,3,5,3],[3,7,4,7]]}
["VII – CLORADOR "]
["ITEM","DESCRIÇÃO DOS MATERIAIS","UNID.","QUANT.","PREÇOS MÁXIMOS (R$)"]
[{"$nulls":4},"UNITARIO","TOTAL","Fonte"]
[22,"CLORADOR DE PASSAGEM POR PASTILHA PARA POÇO"," UN ",100,415,{"$f":"E4*D4","v":41500},"     CAMPEZZA                            (38) 3224-3040                          CNPJ: 28.017.188/0001-08",null,"V1","V2","V3"]
[{"$nulls":4},319,{"$f":"E5*D4","v":31900},"VEMAPE                                                                                  (38) 3690-9000                       CNPJ: 05.150.060/0001-04.",null,{"$f":"E4","v":415},{"$f":"E5","v":319},{"$f":"E6","v":520}]
[{"$nulls":4},520,{"$f":"E6*D4","v":52000},"ACAQUANOVA                           (38) 3372-5111                 CNPJ:25.297.054/0001- 91","Média item 23",{"$f":"(I5+J5+K5)/3","v":418},null,null,null,{"$f":"I6","v":418}]
[]
[]
[{"$nulls":8},35,87]
[]
[]
[]
[]
[]
[]
[{"$nulls":6},{"$f":"100*I6","v":41800}]
[{"$nulls":5},1]

{"sheet":"Média de preços","index":7,"n_rows":39,"n_cols":55,"rows_kept":39,"cut":false,"hidden":true,"merged":[[14,12,15,12],[14,13,15,13],[14,14,15,14],[16,12,17,12],[16,13,17,13],[16,14,17,14],[0,0,0,11],[4,12,5,12],[4,13,5,13],[4,14,5,14],[6,12,7,12],[6,13,7,13],[6,14,7,14],[18,12,19,12],[18,13,19,13],[18,14,19,14],[20,12,21,12],[20,13,21,13],[20,14,21,14],[22,12,23,12],[22,13,23,13],[22,14,23,14],[24,12,25,12],[30,12,31,12],[30,13,31,13],[30,14,31,14],[26,12,27,12],[26,13,27,13],[26,14,27,14],[28,12,29,12],[28,13,29,13],[28,14,29,14],[24,13,25,13],[24,14,25,14],[34,12,35,12],[34,13,35,13],[34,14,35,14],[36,12,37,12],[36,13,37,13],[36,14,37,14]]}
["SISTEMA DE REGISTRO DE PREÇOS - 2018 (GRD)"]
[null,null,null,"DEMAIS EMPRESAS",{"$nulls":5},"DECRETO 8.538/2015 ( ATÉ 25%-EPP)",null,null,"TOTAL"]
[{"$nulls":4},"QUANT. ADQUIRIDA","SALDO","VENCEDORA","PREÇOS MÁXIMOS (R$)",null,"QUANT.","PREÇOS MÁXIMOS (R$)",null,"QUANT. TOAL","PREÇOS MÁXIMOS (R$)"]
["ITEM","DESCRIÇÃO DOS MATERIAIS","UNID.","QUANT.",null,null,null,"UNITARIO","TOTAL",null,"UNITARIO","TOTAL",null,"UNITARIO","TOTAL","1º lugar","Valor","Conferência valor","Aceitação","Habilitação","2º lugar","Valor","Conferência valor","Aceitação","Habilitação","3º lugar","Valor","Conferência valor","Aceitação","Habilitação","4º lugar","Valor","Conferência valor","Aceitação","Habilitação","5º lugar","Valor","Conferência valor","Aceitação","Habilitação","6º lugar","Valor","Conferência valor","Aceitação","Habilitação","7º lugar","Valor","Conferência valor","Aceitação","Habilitação","8º lugar","Valor","Conferência valor","Aceitação","Habilitação"]
[1,{"$f":"Motobomba!B5","v":"CONJUNTO MOTOBOMBA SUBMERSA E CHAVE DE PROTEÇÃO E PARTIDA: MOTOBOMBA SUBMERSA ELÉTRICA, PARA ATENDER UMA VAZÃO MÍNIMA DE 4M3/H E ALTURA MANOMÉTRICA (HMAN) DE 92 MCA, POTÊNCIA MÁXIMA DE 03 (TRÊS) C.V. , MONOFÁSICA, 220 VOLTS E 60 HZ."}," UN ",{"$f":"M5-J6","v":180},null,{"$f":"D5-E5","v":180},"EBARA INDUSTRIAS MECANICAS E COMERCIO LTDA.\nCNPJ: 46.138.319/0001-89",2663.33,{"$f":"ROUND(H5*D5,2)","v":479399.4},null,null,null,{"$f":"Motobomba!D5","v":200},{"$f":"K6","v":2663.33},{"$f":"L6+I5","v":532666},"EDINEIDE DE F. VASQUES BRITO COMERCIO E SERVICOS",1360,{"$f":"IF($Q5>$H5,\"NEGOCIAR\",\"OK\")","v":"OK"},"Recusada",null,"SANIGRAN LTDA",1379.96,{"$f":"IF($V5>$H5,\"NEGOCIAR\",\"OK\")","v":"OK"},"Recusada",null,"BOMBAS RIO PRETO LTDA",1429.99,{"$f":"IF($AA5>$H5,\"NEGOCIAR\",\"OK\")","v":"OK"},"Aceita","Habilitado",null,null,{"$f":"IF($AF5>$H5,\"NEGOCIAR\",\"OK\")","v":"OK"}]
[2,"(Cota de até 25% - Exclusivo para ME e EPP): CONJUNTO MOTOBOMBA SUBMERSA E CHAVE DE PROTEÇÃO E PARTIDA: MOTOBOMBA SUBMERSA ELÉTRICA, PARA ATENDER UMA VAZÃO MÍNIMA DE 4M3/H E ALTURA MANOMÉTRICA (HMAN) DE 92 MCA, POTÊNCIA MÁXIMA DE 03 (TRÊS) C.V. , MONOFÁSICA, 220 VOLTS E 60 HZ."," UN ",{"$f":"J6","v":20},null,null,null,{"$f":"H5","v":2663.33},null,20,{"$f":"H5","v":2663.33},{"$f":"ROUND(K6*J6,2)","v":53266.6},null,null,null,"EDINEIDE DE F. VASQUES BRITO COMERCIO E SERVICOS",1370,"OK","Recusada",null,"SANIGRAN LTDA",1372.96,"OK","Recusada",null,"BOMBAS RIO PRETO LTDA",1429.99,"OK","Aceita","Habilitado",null,null,"OK"]
[3,{"$f":"Motobomba!B8","v":"CONJUNTO MOTOBOMBA SUBMERSA E CHAVE DE PROTEÇÃO E PARTIDA: MOTOBOMBA SUBMERSA ELÉTRICA, PARA ATENDER UMA VAZÃO MÍNIMA DE 8M3/H E ALTURA MANOMÉTRICA (HMAN) DE 92 MCA, POTÊNCIA MÁXIMA DE 05 (CINCO) C.V. , MONOFÁSICA, 220 VOLTS E 60 HZ."}," UN ",{"$f":"M7-J8","v":90},null,90,"BOMBAS RIO PRETO LTDA.\nCNPJ: 59.792.010/0001-50",5060.33,{"$f":"ROUND(H7*D7,2)","v":455429.7},null,null,null,{"$f":"Motobomba!D8","v":100},{"$f":"K8","v":5060.33},{"$f":"L8+I7","v":506033},"BOMBAS RIO PRETO LTDA",2900,"OK","Aceita","Habilitado",null,null,"OK"]
[4,"(Cota de até 25% - Exclusivo para ME e EPP): CONJUNTO MOTOBOMBA SUBMERSA E CHAVE DE PROTEÇÃO E PARTIDA: MOTOBOMBA SUBMERSA ELÉTRICA, PARA ATENDER UMA VAZÃO MÍNIMA DE 8M3/H E ALTURA MANOMÉTRICA (HMAN) DE 92 MCA, POTÊNCIA MÁXIMA DE 05 (CINCO) C.V. , MONOFÁSICA, 220 VOLTS E 60 HZ."," UN ",{"$f":"J8","v":10},null,null,null,{"$f":"H7","v":5060.33},null,10,{"$f":"H7","v":5060.33},{"$f":"ROUND(K8*J8,2)","v":50603.3},null,null,null,"BHS - BOMBAS HIDRAULICAS E SERVICOS LTDA",2700,"OK","Recusada",null,"BOMBAS RIO PRETO LTDA",2900,{"$f":"IF($V8>$H8,\"NEGOCIAR\",\"OK\")","v":"OK"},"Aceita","Habilitado"]
[5,{"$f":"Motobomba!B11","v":"MOTOBOMBA CENTRIFUGA ACOPLADA AO MOTOR A GASOLINA 2,8 CV 4 TEMPOS  COM VAZÃO 16000 L/H E HM = 45 MCA INCLUINDO MANGOTE COM 6M DE COMPRIMENTO, VÁLVULA DE PÉ COM CRIVO, DUAS ABRAÇADEIRAS E DUAS CURVAS DE AÇO"}," UN ",10,null,10,"ITACA EIRELI - ME\nCNPJ: 24.845.457/0001-65",1225,12250,null,null,null,{"$f":"Motobomba!D11","v":10},{"$f":"H9","v":1225},{"$f":"L9+I9","v":12250},"CAMPEZZA IRRIGACAO E EQUIPAMENTOS EIRELI",1103.7,"OK","Aceita","Habilitado",null,null,{"$f":"IF($V9>$H9,\"NEGOCIAR\",\"OK\")","v":"OK"},{"$nulls":4},{"$f":"IF($AA9>$H9,\"NEGOCIAR\",\"OK\")","v":"OK"},{"$nulls":4},"OK"]
[6,{"$f":"Motobomba!B14","v":"MOTOBOMBA CENTRIFUGA ACOPLADA AO MOTOR A GASOLINA 5,5 CV 4 TEMPOS  COM VAZÃO 20000 L/H E HM = 38 MCA  INCLUINDO MANGOTE COM 6M DE COMPRIMENTO, VÁLVULA DE PÉ COM CRIVO, DUAS ABRAÇADEIRAS E DUAS CURVAS DE AÇO"}," UN ",10,null,10,"POTENT DISTRIBUIÇÃO E REPRESENTAÇÃO LTDA\nCNPJ: 03.939.863/0001-17",1776,17760,null,null,null,{"$f":"Motobomba!D14","v":10},1776,17760,"SISTEMINAS LTDA",1769,"OK","Recusada",null,"BRASIDAS EIRELI",1769.95,"OK","Aceita","Habilitado",null,null,"OK",{"$nulls":4},"OK"]
[7,{"$f":"Motobomba!B17","v":"MOTOBOMBA CENTRIFUGA ACOPLADA AO MOTOR A GASOLINA 6,5 CV 4 TEMPOS  COM VAZÃO 36000 L/H E HM = 56 MCA  INCLUINDO MANGOTE COM 6M DE COMPRIMENTO, VÁLVULA DE PÉ COM CRIVO, DUAS ABRAÇADEIRAS E DUAS CURVAS DE AÇO"}," UN ",10,null,10,"POTENT DISTRIBUIÇÃO E REPRESENTAÇÃO LTDA\nCNPJ: 03.939.863/0001-17",1726.67,17266.7,null,null,null,{"$f":"Motobomba!D17","v":10},1726.67,17266.7,"EDINEIDE DE F. VASQUES BRITO COMERCIO E SERVICOS",1448,{"$f":"IF($Q11>$H11,\"NEGOCIAR\",\"OK\")","v":"OK"},"Recusada",null,"CAMPEZZA IRRIGACAO E EQUIPAMENTOS EIRELI",1448.5,"OK","Recusada",null,"BRASIDAS EIRELI",1448.99,{"$f":"IF($AA11>$H11,\"NEGOCIAR\",\"OK\")","v":"OK"},"Aceita","Habilitado",null,null,"OK"]
[8,{"$f":"Motobomba!B20","v":"MOTOBOMBA CENTRÍFUGA  DE EIXO HORIZONTAL, POTÊNCIA MÁXIMA 3CV, ROTOR EM BRONZE COM VAZÃO 5.000 L/H E HM = 100 MCA MONOFÁSICO  INCLUINDO MANGOTE COM 6M DE COMPRIMENTO, VÁLVULA DE PÉ COM CRIVO, DUAS ABRAÇADEIRAS E DUAS CURVAS DE AÇO"},"UN",10,null,10,"HIDROSSOLO SERVICOS AMBIENTAIS E POCOS ARTESIANOS LTDA\nCNPJ: 07.781.094/0001-22",3569,35690,null,null,{"$f":"ROUND(K12*J12,2)","v":0},{"$f":"Motobomba!D20","v":10},3569,35690,"STARMAC INDUSTRIA E COMERCIO LTDA",2756,{"$f":"IF($Q12>$H12,\"NEGOCIAR\",\"OK\")","v":"OK"},"Recusada",null,"CAMPEZZA IRRIGACAO E EQUIPAMENTOS EIRELI",2777,"OK","Recusada",null,"BRASIDAS EIRELI",2854.99,{"$f":"IF($AA12>$H12,\"NEGOCIAR\",\"OK\")","v":"OK"},"Aceita","Habilitado",null,null,"OK"]
[9,{"$f":"Motobomba!B23","v":"MOTOBOMBA CENTRÍFUGA  DE EIXO HORIZONTAL, POTÊNCIA MÁXIMA 5CV, ROTOR EM BRONZE COM VAZÃO 10.000 L/H E HM = 80 MCA MONOFÁSICO INCLUINDO MANGOTE COM 6M DE COMPRIMENTO, VÁLVULA DE PÉ COM CRIVO, DUAS ABRAÇADEIRAS E DUAS CURVAS DE AÇO"},"UN",10,null,10,"HIDROSSOLO SERVICOS AMBIENTAIS E POCOS ARTESIANOS LTDA\nCNPJ: 07.781.094/0001-22",6369.33,63693.3,null,null,null,{"$f":"Motobomba!D23","v":10},6369.33,63693.3,"STARMAC INDUSTRIA E COMERCIO LTDA",4595,"OK","Recusada",null,"EDINEIDE DE F. VASQUES BRITO COMERCIO E SERVICOS",4600,"OK","Recusada",null,"BRASIDAS EIRELI",4733.99,"OK","Aceita","Habilitado",null,null,"OK"]
[10,{"$f":"Motobomba!B26","v":"MOTOBOMBA CENTRÍFUGA  DE EIXO HORIZONTAL, POTÊNCIA MÁXIMA 7,5 CV, ROTOR EM BRONZE COM VAZÃO 10.000 L/H E HM = 100 MCA MONOFÁSICO INCLUINDO MANGOTE COM 6M DE COMPRIMENTO, VÁLVULA DE PÉ COM CRIVO, DUAS ABRAÇADEIRAS E DUAS CURVAS DE AÇO"},"UN",10,null,10,"HIDROSSOLO SERVICOS AMBIENTAIS E POCOS ARTESIANOS LTDA\nCNPJ: 07.781.094/0001-22",8465.67,84656.7,null,null,null,{"$f":"J14+D14","v":10},8465.67,84656.7,"STARMAC INDUSTRIA E COMERCIO LTDA",6418,"OK","Aceita","Habilitado",null,null,"OK",{"$nulls":4},"OK",{"$nulls":4},"OK"]
[11,"RESERVATÓRIO DE POLIETILENO FECHAMENTO RÁPIDO E SEGURO, TAMPA ROSCÁVEL, OLHAIS PARA IÇAMENTO E ANCORAMENTO NA BORDA, DESTINADO A ARMAZENAGEM DE ÁGUA POTÁVEL, ATÓXICO, COM CAPACIDADE DE ARMAZENAMENTO DE 5 M3, COM ORIFICIOS PARA ENTRADA DE 1 ½ POLEGADA E SAIDA DE 1 ½ POLEGADA DE ÁGUA.","UN",{"$f":"M15-J16","v":160},null,{"$f":"D15-E15","v":160},"FORTLEV INDUSTRIA E COMERCIO DE PLASTICOS LTDA.\nCNPJ: 10.921.911/0005-39",1691,{"$f":"ROUND(H15*D15,2)","v":270560},null,null,null,{"$f":"Reservatórios!D4","v":180},{"$f":"K16","v":1691},{"$f":"L16+I15","v":304380},"USINORTE POLIETILENO LTDA",1008,"OK","Aceita","Habilitado",null,null,"OK",{"$nulls":4},"OK",{"$nulls":4},"OK"]
[12,"(Cota de até 25% - Exclusivo para ME e EPP): RESERVATÓRIO DE POLIETILENO FECHAMENTO RÁPIDO E SEGURO, TAMPA ROSCÁVEL, OLHAIS PARA IÇAMENTO E ANCORAMENTO NA BORDA, DESTINADO A ARMAZENAGEM DE ÁGUA POTÁVEL, ATÓXICO, COM CAPACIDADE DE ARMAZENAMENTO DE 5 M3, COM ORIFICIOS PARA ENTRADA DE 1 ½ POLEGADA E SAIDA DE 1 ½ POLEGADA DE ÁGUA.","UN",{"$f":"J16","v":20},null,null,null,{"$f":"H15","v":1691},null,20,{"$f":"H15","v":1691},{"$f":"ROUND(K16*J16,2)","v":33820},null,null,null,"LICITARE PRODUTOS, MATERIAIS E SERVICOS LTDA",1249.99,"OK","Aceita","Habilitado",null,null,"OK",{"$nulls":4},"OK",{"$nulls":4},"OK"]
[13,"RESERVATÓRIO DE POLIETILENO FECHAMENTO RÁPIDO E SEGURO, TAMPA ROSCÁVEL, OLHAIS PARA IÇAMENTO E ANCORAMENTO NA BORDA, DESTINADO A ARMAZENAGEM DE ÁGUA POTÁVEL, ATÓXICO, COM CAPACIDADE DE ARMAZENAMENTO DE 10 M3, COM ORIFICIOS PARA ENTRADA DE 1 ½ POLEGADA E SAIDA DE 1 ½ POLEGADA DE ÁGUA.","UN",{"$f":"M17-J18","v":180},null,{"$f":"D17-E17","v":180},"FORTLEV INDUSTRIA E COMERCIO DE PLASTICOS LTDA.\nCNPJ: 10.921.911/0005-39",2938,{"$f":"ROUND(H17*D17,2)","v":528840},null,null,null,{"$f":"Reservatórios!D7","v":200},{"$f":"K18","v":2938},{"$f":"L18+I17","v":587600},"USINORTE POLIETILENO LTDA",2000,"OK","Aceita","Habilitado",null,null,"OK",{"$nulls":4},"OK",{"$nulls":4},"OK"]
[14,"(Cota de até 25% - Exclusivo para ME e EPP): RESERVATÓRIO DE POLIETILENO FECHAMENTO RÁPIDO E SEGURO, TAMPA ROSCÁVEL, OLHAIS PARA IÇAMENTO E ANCORAMENTO NA BORDA, DESTINADO A ARMAZENAGEM DE ÁGUA POTÁVEL, ATÓXICO, COM CAPACIDADE DE ARMAZENAMENTO DE 10 M3, COM ORIFICIOS PARA ENTRADA DE 1 ½ POLEGADA E SAIDA DE 1 ½ POLEGADA DE ÁGUA.","UN",{"$f":"J18","v":20},null,null,null,{"$f":"H17","v":2938},null,20,{"$f":"H17","v":2938},{"$f":"ROUND(K18*J18,2)","v":58760},null,null,null,"USINORTE POLIETILENO LTDA",2000,"OK","Aceita","Habilitado",null,null,"OK",{"$nulls":4},"OK",{"$nulls":4},"OK"]
[15,"RESERVATÓRIO DE POLIETILENO FECHAMENTO RÁPIDO E SEGURO, TAMPA ROSCÁVEL, OLHAIS PARA IÇAMENTO E ANCORAMENTO NA BORDA, DESTINADO A ARMAZENAGEM DE ÁGUA POTÁVEL, ATÓXICO, COM CAPACIDADE DE ARMAZENAMENTO DE 15 M3, COM ORIFICIOS PARA ENTRADA DE 1 ½ POLEGADA E SAIDA DE 1 ½ POLEGADA DE ÁGUA.","UN",{"$f":"M19-J20","v":35},null,{"$f":"D19-E19","v":35},"DALKA DO BRASIL LTDA\nCNPJ: 04.120.719/0001-17",4982.67,174393.45,null,null,null,{"$f":"Reservatórios!D10","v":40},{"$f":"K20","v":4982.67},{"$f":"L20+I19","v":199306.80000000002},"BAKOF PLASTICOS LTDA",3022.75,"OK","Aceita","Habilitada",null,null,"OK",{"$nulls":4},"OK",{"$nulls":4},"OK"]
[16,"(Cota de até 25% - Exclusivo para ME e EPP): RESERVATÓRIO DE POLIETILENO FECHAMENTO RÁPIDO E SEGURO, TAMPA ROSCÁVEL, OLHAIS PARA IÇAMENTO E ANCORAMENTO NA BORDA, DESTINADO A ARMAZENAGEM DE ÁGUA POTÁVEL, ATÓXICO, COM CAPACIDADE DE ARMAZENAMENTO DE 15 M3, COM ORIFICIOS PARA ENTRADA DE 1 ½ POLEGADA E SAIDA DE 1 ½ POLEGADA DE ÁGUA.","UN",{"$f":"J20","v":5},null,null,null,{"$f":"H19","v":4982.67},null,5,{"$f":"H19","v":4982.67},{"$f":"ROUND(K20*J20,2)","v":24913.35},null,null,null,"SERTAO FIBRAS INDUSTRIA LTDA",null,"Recusada",null,null,"LICITARE PRODUTOS, MATERIAIS E SERVICOS LTDA",3814.46,"OK","Aceita","Habilitado",null,null,"OK",{"$nulls":4},"OK"]
[17,"TUBO DE PVC, PN 60 DE-25MM, SOLDÁVEL, PONTA E BOLSA, COMPRIMENTO 6M - NBR 14654","UN",{"$f":"M21-J22","v":27000},null,{"$f":"D21-E21","v":27000},"POLYVIN PLASTICOS E DERIVADOS LTDA.\nCNPJ: 41.664.871/0001-97",8.6300000000000008,{"$f":"ROUND(H21*D21,2)","v":233010},null,null,null,{"$f":"'Tubos e conexões'!B30","v":30000},{"$f":"K22","v":8.6300000000000008},{"$f":"L22+I21","v":258900},"POLYVIN PLASTICOS E DERIVADOS LTDA",6.5,"OK","Aceita","Habilitada",null,null,"OK",{"$nulls":4},"OK",{"$nulls":4},"OK"]
[18,"(Cota de até 25% - Exclusivo para ME e EPP): TUBO DE PVC, PN 60 DE-25MM, SOLDÁVEL, PONTA E BOLSA, COMPRIMENTO 6M - NBR 14654","UN",{"$f":"J22","v":3000},null,null,null,{"$f":"H21","v":8.6300000000000008},null,3000,{"$f":"H21","v":8.6300000000000008},{"$f":"ROUND(K22*J22,2)","v":25890},null,null,null,"GUSTAVO VINICIUS DE SOUZA REPRESENTACOES COMERCIAIS",7.39,"OK","Aceita","Habilitada",null,null,"OK",{"$nulls":4},"OK",{"$nulls":4},"OK"]
[19,"TUBO DE PVC, PN 60 DN-32MM, SOLDÁVEL, PONTA E BOLSA, COMPRIMENTO 6M - NBR 14654","UN",{"$f":"M23-J24","v":27000},null,27000,"POLYVIN PLASTICOS E DERIVADOS LTDA.\nCNPJ: 41.664.871/0001-97",14.71,397170,null,null,null,{"$f":"'Tubos e conexões'!B31","v":30000},{"$f":"K24","v":14.71},{"$f":"L24+I23","v":441300},"POLYVIN PLASTICOS E DERIVADOS LTDA",10.29,"OK","Aceita","Habilitada",null,null,"OK",{"$nulls":4},"OK",{"$nulls":4},"OK"]
[20,"(Cota de até 25% - Exclusivo para ME e EPP): TUBO DE PVC, PN 60 DN-32MM, SOLDÁVEL, PONTA E BOLSA, COMPRIMENTO 6M - NBR 14654","UN",{"$f":"J24","v":3000},null,null,null,{"$f":"H23","v":14.71},null,3000,{"$f":"H23","v":14.71},{"$f":"ROUND(K24*J24,2)","v":44130},null,null,null,"BAL COMERCIO E SERVICOS LTDA",11,"OK","Aceita","Habilitada",null,null,"OK",{"$nulls":4},"OK",{"$nulls":4},"OK"]
[21,"TUBO DE PVC, PN 80 DN-50MM, SOLDÁVEL, PONTA E BOLSA, COMPRIMENTO 6M  - NBR 14312","UN",{"$f":"180000-J26","v":177500},null,177500,"POLYVIN PLASTICOS E DERIVADOS LTDA.\nCNPJ: 41.664.871/0001-97",30,5325000,null,null,null,{"$f":"'Tubos e conexões'!B32","v":180000},{"$f":"K26","v":30},{"$f":"L26+I25","v":5400000},"UNOCANN TUBOS E CONEXOES LTDA",20.100000000000001,"OK","Aceita","Habilitada",null,null,"OK",{"$nulls":4},"OK",{"$nulls":4},"OK"]
[22,"(Cota de até 25% - Exclusivo para ME e EPP): TUBO DE PVC, PN 80 DN-50MM, SOLDÁVEL, PONTA E BOLSA, COMPRIMENTO 6M  - NBR 14312","UN",{"$f":"J26","v":2500},null,null,null,{"$f":"H25","v":30},null,2500,{"$f":"H25","v":30},{"$f":"ROUND(K26*J26,2)","v":75000},null,null,null,"BAL COMERCIO E SERVICOS LTDA",21.5,"OK","Aceita","Habilitada",null,null,"OK",{"$nulls":4},"OK",{"$nulls":4},"OK"]
[23,"TUBO GALVANIZADO COM ROSCA BSP E LUVA, DN 1 ¹/² \", PN 15 Kgf / cm², CLASSE M - NBR 5580","UN ",{"$f":"M27-J28","v":900},null,"-","CANCELADO","CANCELADO",{"$error":"#VALUE!"},null,null,null,{"$f":"'Tubos e conexões'!B33","v":1000},{"$f":"K28","v":"CANCELADO"},{"$f":"L28+I27","v":{"$error":"#VALUE!"}},"CAMPEZZA IRRIGACAO E EQUIPAMENTOS EIRELI",215,"OK","Recusada",null,"VILAS BOAS & RIOS LTDA",250,"OK","Recusada",null,"PORTINARI DISTRIBUICAO E IMPORTACAO EIRELI",251.66,"OK","Recusada",null,"MERCEARIA INDIANOPOLIS LTDA",500,{"$f":"IF($AF27>$H27,\"NEGOCIAR\",\"OK\")","v":"OK"}]
[24,"(Cota de até 25% - Exclusivo para ME e EPP): TUBO GALVANIZADO COM ROSCA BSP E LUVA, DN 1 ¹/² \", PN 15 Kgf / cm², CLASSE M - NBR 5580","UN ",{"$f":"J28","v":100},null,null,null,"CANCELADO",null,100,{"$f":"H27","v":"CANCELADO"},{"$f":"ROUND(K28*J28,2)","v":{"$error":"#VALUE!"}},null,null,null,"CAMPEZZA IRRIGACAO E EQUIPAMENTOS EIRELI",215,"OK","Recusada",null,"VILAS BOAS & RIOS LTDA",250,"OK","Recusada",null,"PORTINARI DISTRIBUICAO E IMPORTACAO EIRELI",251.66,"OK","Recusada",null,"MERCEARIA INDIANOPOLIS LTDA",500,{"$f":"IF($AF28>$H28,\"NEGOCIAR\",\"OK\")","v":"OK"},"Recusada"]
[25,"TUBO DE PVC PBA, CLASSE 15, JUNTA ELASTICA, REDE AGUA, COMPRIMENTO 6M, DN-75MM - NBR 5647","UN",{"$f":"M29-J30","v":1800},null,{"$f":"D29-E29","v":1800},"POLYVIN PLASTICOS E DERIVADOS LTDA.\nCNPJ: 41.664.871/0001-97",126.12,227016,null,null,null,{"$f":"'Tubos e conexões'!B34","v":2000},{"$f":"K30","v":126.12},{"$f":"L30+I29","v":252240},"POLYVIN PLASTICOS E DERIVADOS LTDA",92,"OK","Aceita","Habilitada",null,null,"OK",{"$nulls":4},"OK",{"$nulls":4},"OK"]
[26,"(Cota de até 25% - Exclusivo para ME e EPP): TUBO DE PVC PBA, CLASSE 15, JUNTA ELASTICA, REDE AGUA, COMPRIMENTO 6M, DN-75MM - NBR 5647","UN",{"$f":"J30","v":200},null,null,null,{"$f":"H29","v":126.12},null,200,{"$f":"H29","v":126.12},{"$f":"ROUND(K30*J30,2)","v":25224},null,null,null,"BAL COMERCIO E SERVICOS LTDA",99,"OK","Aceita","Habilitada",null,null,"OK",{"$nulls":4},"OK",{"$nulls":4},"OK"]
[27,"TUBO DE PVC PBA, CLASSE 15, JUNTA ELASTICA, REDE AGUA, COMPRIMENTO 6M, DN-100MM - NBR 5647","UN",{"$f":"M31-J32","v":1800},null,{"$f":"D31-E31","v":1800},"MERCEARIA INDIANAPOLIS LTDA\nCNPJ: 17.263.096/0001-83",209.04,376272,null,null,null,{"$f":"'Tubos e conexões'!B35","v":2000},{"$f":"K32","v":209.04},{"$f":"L32+I31","v":418080},"POLYVIN PLASTICOS E DERIVADOS LTDA",149,"OK","Aceita","Habilitada",null,null,"OK",{"$nulls":4},"OK",{"$nulls":4},"OK"]
[28,"(Cota de até 25% - Exclusivo para ME e EPP): TUBO DE PVC PBA, CLASSE 15, JUNTA ELASTICA, REDE AGUA, COMPRIMENTO 6M, DN-100MM - NBR 5647","UN",{"$f":"J32","v":200},null,null,null,{"$f":"H31","v":209.04},null,200,{"$f":"H31","v":209.04},{"$f":"ROUND(K32*J32,2)","v":41808},null,null,null,"BAL COMERCIO E SERVICOS LTDA",165,"OK","Aceita","Habilitada",null,null,"OK",{"$nulls":4},"OK",{"$nulls":4},"OK"]
[29,"CABO TRIPOLAR DE 3x10mm, SISTEMA FLEXÍVEL, 1.000v","M",2000,null,{"$f":"D33-E33","v":2000},"LUCIANO VILAS BOAS RIOS - ME\nCNPJ: 05.155.897/0001-46","CANCELADO",{"$f":"ROUND(H33*D33,2)","v":{"$error":"#VALUE!"}},null,null,null,{"$f":"'Material elétrico'!E13","v":2000},{"$f":"H33","v":"CANCELADO"},{"$f":"L33+I33","v":{"$error":"#VALUE!"}},"RICARDO ANTONIO DA ROCHA HECK",15,"OK","Recusada",null,"WZ UNIAO AUTOMACAO E ELETRICA EIRELI",17.27,"OK","Recusada",null,"CAMPEZZA IRRIGACAO E EQUIPAMENTOS EIRELI",17.3,"OK","Recusada",null,"META COMERCIO DE FERRAGENS E FERRAMENTAS EIRELI",100,"OK","Recusada"]
[30,"FIO ENCAPADO 10mm","M",2000,null,{"$f":"D34-E34","v":2000},"LUCIANO VILAS BOAS RIOS - ME\nCNPJ: 05.155.897/0001-46","CANCELADO",{"$error":"#VALUE!"},null,null,null,{"$f":"'Material elétrico'!E14","v":2000},{"$f":"H34","v":"CANCELADO"},{"$error":"#VALUE!"},"RICARDO ANTONIO DA ROCHA HECK",3.98,"OK","Recusada",null,"CAMPEZZA IRRIGACAO E EQUIPAMENTOS EIRELI",3.99,"OK","Recusada",null,null,null,"OK",{"$nulls":4},"OK"]
[{"$f":"A34+1","v":31},"HIDRÔMETRO UNIJATO 3/4\" COM VAZÃO NOMINAL = 1,5 M³ CONFORME NBR 8009, 8193 A 8195 DA ABNT, INCLUSO VIROLAS"," UN ",{"$f":"M35-J36","v":1800},null,{"$f":"D35-E35","v":1800},"HIDROSSOLO SERVICOS AMBIENTAIS E POCOS ARTESIANOS LTDA\nCNPJ: 07.781.094/0001-22",110.73,{"$f":"ROUND(H35*D35,2)","v":199314},null,null,null,{"$f":"Hidrômetro!D4","v":2000},{"$f":"K36","v":110.73},{"$f":"L36+I35","v":221460},"SAGA MEDICAO LTDA",75,"OK","Aceita","Habilitada",null,null,"OK",{"$nulls":4},"OK",{"$nulls":4},"OK"]
[32,"(Cota de até 25% - Exclusivo para ME e EPP): HIDRÔMETRO UNIJATO 3/4\" COM VAZÃO NOMINAL = 1,5 M³ CONFORME NBR 8009, 8193 A 8195 DA ABNT, INCLUSO VIROLAS"," UN ",200,null,null,null,110.73,null,200,{"$f":"H35","v":110.73},{"$f":"ROUND(K36*J36,2)","v":22146},null,null,null,"HG COMERCIO DE MATERIAIS HIDRAULICOS EIRELI",75,"OK","Aceita","Habilitada",null,null,"OK",{"$nulls":4},"OK",{"$nulls":4},"OK"]
[33,"TUBO CONCRETO ARMADO, CLASSE PA-2, PB, DN 1000 MM, PARA AGUAS PLUVIAIS (NBR8890)"," UN ",{"$f":"M37-J38","v":450},{"$nulls":4},0,null,null,null,{"$f":"'Tubo em concreto'!D12","v":500},{"$f":"K38","v":0},{"$f":"L38+I37","v":0},"Deserto",null,"OK"]
[34,"(Cota de até 25% - Exclusivo para ME e EPP): TUBO CONCRETO ARMADO, CLASSE PA-2, PB, DN 1000 MM, PARA AGUAS PLUVIAIS (NBR8890)"," UN ",{"$f":"J38","v":50},null,null,null,{"$f":"H37","v":0},null,50,{"$f":"H37","v":0},{"$f":"ROUND(K38*J38,2)","v":0},null,null,null,"Deserto",null,"OK"]
[35,"CLORADOR DE PASSAGEM POR PASTILHA PARA POÇO"," UN ",100,null,null,null,418,41800,null,null,{"$f":"ROUND(K39*J39,2)","v":0},{"$f":"Clorador!D4","v":100},{"$f":"H39","v":418},{"$f":"L39+I39","v":41800},"RPF COMERCIAL EIRELI",418,"OK","Aceita","Habilitada",null,null,{"$f":"IF($V39>$H39,\"NEGOCIAR\",\"OK\")","v":"OK"},{"$nulls":4},{"$f":"IF($AA39>$H39,\"NEGOCIAR\",\"OK\")","v":"OK"}]

{"sheet":"Quadro Final","index":8,"n_rows":38,"n_cols":9,"rows_kept":38,"cut":false,"hidden":false,"merged":[[34,2,34,8],[35,2,35,8],[30,2,30,8],[31,2,31,8],[24,2,24,8],[25,2,25,8],[14,4,15,4],[2,5,5,5],[7,5,10,5],[14,5,15,5],[0,0,0,8],[2,4,5,4],[7,4,10,4]]}
["QUADRO DEMONSTRATIVO FINAL - EDITAL Nº 040-2018 (PREGÃO ELETRÔNICO)"]
["Item","Descrição","Valor estimado (unit.)","Qtde.","Vencedora","CNPJ","Valor unit.","Total","Economia (%)"]
[1,{"$f":"'Média de preços'!$B5","v":"CONJUNTO MOTOBOMBA SUBMERSA E CHAVE DE PROTEÇÃO E PARTIDA: MOTOBOMBA SUBMERSA ELÉTRICA, PARA ATENDER UMA VAZÃO MÍNIMA DE 4M3/H E ALTURA MANOMÉTRICA (HMAN) DE 92 MCA, POTÊNCIA MÁXIMA DE 03 (TRÊS) C.V. , MONOFÁSICA, 220 VOLTS E 60 HZ."},{"$f":"'Média de preços'!$H5","v":2663.33},{"$f":"'Média de preços'!D5","v":180},{"$f":"'Média de preços'!Z5","v":"BOMBAS RIO PRETO LTDA"},"59.792.010/0001-50",{"$f":"'Média de preços'!AA5","v":1429.99},{"$f":"$D3*$G3","v":257398.2},{"$f":"($C3-$G3)/$C3","v":0.46308193126649716}]
[2,{"$f":"'Média de preços'!$B6","v":"(Cota de até 25% - Exclusivo para ME e EPP): CONJUNTO MOTOBOMBA SUBMERSA E CHAVE DE PROTEÇÃO E PARTIDA: MOTOBOMBA SUBMERSA ELÉTRICA, PARA ATENDER UMA VAZÃO MÍNIMA DE 4M3/H E ALTURA MANOMÉTRICA (HMAN) DE 92 MCA, POTÊNCIA MÁXIMA DE 03 (TRÊS) C.V. , MONOFÁSICA, 220 VOLTS E 60 HZ."},{"$f":"'Média de preços'!$H6","v":2663.33},{"$f":"'Média de preços'!D6","v":20},null,null,{"$f":"G3","v":1429.99},{"$f":"$D4*$G4","v":28599.8},{"$f":"($C4-$G4)/$C4","v":0.46308193126649716}]
[3,{"$f":"'Média de preços'!$B7","v":"CONJUNTO MOTOBOMBA SUBMERSA E CHAVE DE PROTEÇÃO E PARTIDA: MOTOBOMBA SUBMERSA ELÉTRICA, PARA ATENDER UMA VAZÃO MÍNIMA DE 8M3/H E ALTURA MANOMÉTRICA (HMAN) DE 92 MCA, POTÊNCIA MÁXIMA DE 05 (CINCO) C.V. , MONOFÁSICA, 220 VOLTS E 60 HZ."},{"$f":"'Média de preços'!$H7","v":5060.33},{"$f":"'Média de preços'!D7","v":90},null,null,{"$f":"'Média de preços'!Q7","v":2900},261000,0.42691484547450465]
[4,{"$f":"'Média de preços'!$B8","v":"(Cota de até 25% - Exclusivo para ME e EPP): CONJUNTO MOTOBOMBA SUBMERSA E CHAVE DE PROTEÇÃO E PARTIDA: MOTOBOMBA SUBMERSA ELÉTRICA, PARA ATENDER UMA VAZÃO MÍNIMA DE 8M3/H E ALTURA MANOMÉTRICA (HMAN) DE 92 MCA, POTÊNCIA MÁXIMA DE 05 (CINCO) C.V. , MONOFÁSICA, 220 VOLTS E 60 HZ."},{"$f":"'Média de preços'!$H8","v":5060.33},{"$f":"'Média de preços'!D8","v":10},null,null,{"$f":"G5","v":2900},29000,0.42691484547450465]
[5,{"$f":"'Média de preços'!$B9","v":"MOTOBOMBA CENTRIFUGA ACOPLADA AO MOTOR A GASOLINA 2,8 CV 4 TEMPOS  COM VAZÃO 16000 L/H E HM = 45 MCA INCLUINDO MANGOTE COM 6M DE COMPRIMENTO, VÁLVULA DE PÉ COM CRIVO, DUAS ABRAÇADEIRAS E DUAS CURVAS DE AÇO"},{"$f":"'Média de preços'!$H9","v":1225},{"$f":"'Média de preços'!D9","v":10},{"$f":"'Média de preços'!P9","v":"CAMPEZZA IRRIGACAO E EQUIPAMENTOS EIRELI"},"28.017.188/0001-08",{"$f":"'Média de preços'!Q9","v":1103.7},11037,9.9020408163265267E-2]
[6,{"$f":"'Média de preços'!$B10","v":"MOTOBOMBA CENTRIFUGA ACOPLADA AO MOTOR A GASOLINA 5,5 CV 4 TEMPOS  COM VAZÃO 20000 L/H E HM = 38 MCA  INCLUINDO MANGOTE COM 6M DE COMPRIMENTO, VÁLVULA DE PÉ COM CRIVO, DUAS ABRAÇADEIRAS E DUAS CURVAS DE AÇO"},{"$f":"'Média de preços'!$H10","v":1776},{"$f":"'Média de preços'!D10","v":10},{"$f":"'Média de preços'!U10","v":"BRASIDAS EIRELI"},"20.483.193/0001-96",{"$f":"'Média de preços'!V10","v":1769.95},17699.5,3.4065315315315058E-3]
[7,{"$f":"'Média de preços'!$B11","v":"MOTOBOMBA CENTRIFUGA ACOPLADA AO MOTOR A GASOLINA 6,5 CV 4 TEMPOS  COM VAZÃO 36000 L/H E HM = 56 MCA  INCLUINDO MANGOTE COM 6M DE COMPRIMENTO, VÁLVULA DE PÉ COM CRIVO, DUAS ABRAÇADEIRAS E DUAS CURVAS DE AÇO"},{"$f":"'Média de preços'!$H11","v":1726.67},{"$f":"'Média de preços'!D11","v":10},null,null,{"$f":"'Média de preços'!AA11","v":1448.99},14489.9,0.16081822235864413]
[8,{"$f":"'Média de preços'!$B12","v":"MOTOBOMBA CENTRÍFUGA  DE EIXO HORIZONTAL, POTÊNCIA MÁXIMA 3CV, ROTOR EM BRONZE COM VAZÃO 5.000 L/H E HM = 100 MCA MONOFÁSICO  INCLUINDO MANGOTE COM 6M DE COMPRIMENTO, VÁLVULA DE PÉ COM CRIVO, DUAS ABRAÇADEIRAS E DUAS CURVAS DE AÇO"},{"$f":"'Média de preços'!$H12","v":3569},{"$f":"'Média de preços'!D12","v":10},null,null,{"$f":"'Média de preços'!AA12","v":2854.99},28549.899999999998,0.20005884001120769]
[9,{"$f":"'Média de preços'!$B13","v":"MOTOBOMBA CENTRÍFUGA  DE EIXO HORIZONTAL, POTÊNCIA MÁXIMA 5CV, ROTOR EM BRONZE COM VAZÃO 10.000 L/H E HM = 80 MCA MONOFÁSICO INCLUINDO MANGOTE COM 6M DE COMPRIMENTO, VÁLVULA DE PÉ COM CRIVO, DUAS ABRAÇADEIRAS E DUAS CURVAS DE AÇO"},{"$f":"'Média de preços'!$H13","v":6369.33},{"$f":"'Média de preços'!D13","v":10},null,null,{"$f":"'Média de preços'!AA13","v":4733.99},47339.899999999994,0.25675228006713424]
[10,{"$f":"'Média de preços'!$B14","v":"MOTOBOMBA CENTRÍFUGA  DE EIXO HORIZONTAL, POTÊNCIA MÁXIMA 7,5 CV, ROTOR EM BRONZE COM VAZÃO 10.000 L/H E HM = 100 MCA MONOFÁSICO INCLUINDO MANGOTE COM 6M DE COMPRIMENTO, VÁLVULA DE PÉ COM CRIVO, DUAS ABRAÇADEIRAS E DUAS CURVAS DE AÇO"},{"$f":"'Média de preços'!$H14","v":8465.67},{"$f":"'Média de preços'!D14","v":10},{"$f":"'Média de preços'!$P14","v":"STARMAC INDUSTRIA E COMERCIO LTDA"},"10.796.174/0001-66",{"$f":"'Média de preços'!$Q14","v":6418},64180,0.2418792605901246]
[11,{"$f":"'Média de preços'!$B15","v":"RESERVATÓRIO DE POLIETILENO FECHAMENTO RÁPIDO E SEGURO, TAMPA ROSCÁVEL, OLHAIS PARA IÇAMENTO E ANCORAMENTO NA BORDA, DESTINADO A ARMAZENAGEM DE ÁGUA POTÁVEL, ATÓXICO, COM CAPACIDADE DE ARMAZENAMENTO DE 5 M3, COM ORIFICIOS PARA ENTRADA DE 1 ½ POLEGADA E SAIDA DE 1 ½ POLEGADA DE ÁGUA."},{"$f":"'Média de preços'!$H15","v":1691},{"$f":"'Média de preços'!D15","v":160},{"$f":"'Média de preços'!$P15","v":"USINORTE POLIETILENO LTDA"},"09.607.249/0001-34",{"$f":"'Média de preços'!$Q15","v":1008},161280,0.40390301596688349]
[12,{"$f":"'Média de preços'!$B16","v":"(Cota de até 25% - Exclusivo para ME e EPP): RESERVATÓRIO DE POLIETILENO FECHAMENTO RÁPIDO E SEGURO, TAMPA ROSCÁVEL, OLHAIS PARA IÇAMENTO E ANCORAMENTO NA BORDA, DESTINADO A ARMAZENAGEM DE ÁGUA POTÁVEL, ATÓXICO, COM CAPACIDADE DE ARMAZENAMENTO DE 5 M3, COM ORIFICIOS PARA ENTRADA DE 1 ½ POLEGADA E SAIDA DE 1 ½ POLEGADA DE ÁGUA."},{"$f":"'Média de preços'!$H16","v":1691},{"$f":"'Média de preços'!D16","v":20},{"$f":"'Média de preços'!$P16","v":"LICITARE PRODUTOS, MATERIAIS E SERVICOS LTDA"},"18.641.075/0001-17",{"$f":"'Média de preços'!$Q16","v":1249.99},24999.8,0.26079834417504433]
[13,{"$f":"'Média de preços'!$B17","v":"RESERVATÓRIO DE POLIETILENO FECHAMENTO RÁPIDO E SEGURO, TAMPA ROSCÁVEL, OLHAIS PARA IÇAMENTO E ANCORAMENTO NA BORDA, DESTINADO A ARMAZENAGEM DE ÁGUA POTÁVEL, ATÓXICO, COM CAPACIDADE DE ARMAZENAMENTO DE 10 M3, COM ORIFICIOS PARA ENTRADA DE 1 ½ POLEGADA E SAIDA DE 1 ½ POLEGADA DE ÁGUA."},{"$f":"'Média de preços'!$H17","v":2938},{"$f":"'Média de preços'!D17","v":180},{"$f":"'Média de preços'!$P17","v":"USINORTE POLIETILENO LTDA"},"09.607.249/0001-34",{"$f":"'Média de preços'!$Q17","v":2000},360000,0.31926480599046969]
[14,{"$f":"'Média de preços'!$B18","v":"(Cota de até 25% - Exclusivo para ME e EPP): RESERVATÓRIO DE POLIETILENO FECHAMENTO RÁPIDO E SEGURO, TAMPA ROSCÁVEL, OLHAIS PARA IÇAMENTO E ANCORAMENTO NA BORDA, DESTINADO A ARMAZENAGEM DE ÁGUA POTÁVEL, ATÓXICO, COM CAPACIDADE DE ARMAZENAMENTO DE 10 M3, COM ORIFICIOS PARA ENTRADA DE 1 ½ POLEGADA E SAIDA DE 1 ½ POLEGADA DE ÁGUA."},{"$f":"'Média de preços'!$H18","v":2938},{"$f":"'Média de preços'!D18","v":20},null,null,{"$f":"'Média de preços'!$Q18","v":2000},40000,0.31926480599046969]
[15,{"$f":"'Média de preços'!$B19","v":"RESERVATÓRIO DE POLIETILENO FECHAMENTO RÁPIDO E SEGURO, TAMPA ROSCÁVEL, OLHAIS PARA IÇAMENTO E ANCORAMENTO NA BORDA, DESTINADO A ARMAZENAGEM DE ÁGUA POTÁVEL, ATÓXICO, COM CAPACIDADE DE ARMAZENAMENTO DE 15 M3, COM ORIFICIOS PARA ENTRADA DE 1 ½ POLEGADA E SAIDA DE 1 ½ POLEGADA DE ÁGUA."},{"$f":"'Média de preços'!$H19","v":4982.67},{"$f":"'Média de preços'!D19","v":35},{"$f":"'Média de preços'!$P19","v":"BAKOF PLASTICOS LTDA"},"91.967.067/0001-55",{"$f":"'Média de preços'!$Q19","v":3022.75},105796.25,0.39334734188698028]
[16,{"$f":"'Média de preços'!$B20","v":"(Cota de até 25% - Exclusivo para ME e EPP): RESERVATÓRIO DE POLIETILENO FECHAMENTO RÁPIDO E SEGURO, TAMPA ROSCÁVEL, OLHAIS PARA IÇAMENTO E ANCORAMENTO NA BORDA, DESTINADO A ARMAZENAGEM DE ÁGUA POTÁVEL, ATÓXICO, COM CAPACIDADE DE ARMAZENAMENTO DE 15 M3, COM ORIFICIOS PARA ENTRADA DE 1 ½ POLEGADA E SAIDA DE 1 ½ POLEGADA DE ÁGUA."},{"$f":"'Média de preços'!$H20","v":4982.67},{"$f":"'Média de preços'!D20","v":5},{"$f":"'Média de preços'!U20","v":"LICITARE PRODUTOS, MATERIAIS E SERVICOS LTDA"},"18.641.075/0001-17",{"$f":"'Média de preços'!V20","v":3814.46},19072.3,0.23445461971192152]
[17,{"$f":"'Média de preços'!$B21","v":"TUBO DE PVC, PN 60 DE-25MM, SOLDÁVEL, PONTA E BOLSA, COMPRIMENTO 6M - NBR 14654"},{"$f":"'Média de preços'!$H21","v":8.6300000000000008},{"$f":"'Média de preços'!D21","v":27000},{"$f":"'Média de preços'!$P21","v":"POLYVIN PLASTICOS E DERIVADOS LTDA"},"41.664.871/0001-97",{"$f":"'Média de preços'!$Q21","v":6.5},175500,0.24681344148319823]
[18,{"$f":"'Média de preços'!$B22","v":"(Cota de até 25% - Exclusivo para ME e EPP): TUBO DE PVC, PN 60 DE-25MM, SOLDÁVEL, PONTA E BOLSA, COMPRIMENTO 6M - NBR 14654"},{"$f":"'Média de preços'!$H22","v":8.6300000000000008},{"$f":"'Média de preços'!D22","v":3000},{"$f":"'Média de preços'!$P22","v":"GUSTAVO VINICIUS DE SOUZA REPRESENTACOES COMERCIAIS"},"28.526.595/0001-32",{"$f":"'Média de preços'!$Q22","v":7.39},22170,0.14368482039397462]
[19,{"$f":"'Média de preços'!$B23","v":"TUBO DE PVC, PN 60 DN-32MM, SOLDÁVEL, PONTA E BOLSA, COMPRIMENTO 6M - NBR 14654"},{"$f":"'Média de preços'!$H23","v":14.71},{"$f":"'Média de preços'!D23","v":27000},{"$f":"'Média de preços'!$P23","v":"POLYVIN PLASTICOS E DERIVADOS LTDA"},"41.664.871/0001-97",{"$f":"'Média de preços'!$Q23","v":10.29},277830,0.30047586675730803]
[20,{"$f":"'Média de preços'!$B24","v":"(Cota de até 25% - Exclusivo para ME e EPP): TUBO DE PVC, PN 60 DN-32MM, SOLDÁVEL, PONTA E BOLSA, COMPRIMENTO 6M - NBR 14654"},{"$f":"'Média de preços'!$H24","v":14.71},{"$f":"'Média de preços'!D24","v":3000},{"$f":"'Média de preços'!$P24","v":"BAL COMERCIO E SERVICOS LTDA"},"11.317.774/0001-67",{"$f":"'Média de preços'!$Q24","v":11},33000,0.25220938137321552]
[21,{"$f":"'Média de preços'!$B25","v":"TUBO DE PVC, PN 80 DN-50MM, SOLDÁVEL, PONTA E BOLSA, COMPRIMENTO 6M  - NBR 14312"},{"$f":"'Média de preços'!$H25","v":30},{"$f":"'Média de preços'!D25","v":177500},{"$f":"'Média de preços'!$P25","v":"UNOCANN TUBOS E CONEXOES LTDA"},"86.632.239/0001-08",{"$f":"'Média de preços'!$Q25","v":20.100000000000001},3567750.0000000005,0.32999999999999996]
[22,{"$f":"'Média de preços'!$B26","v":"(Cota de até 25% - Exclusivo para ME e EPP): TUBO DE PVC, PN 80 DN-50MM, SOLDÁVEL, PONTA E BOLSA, COMPRIMENTO 6M  - NBR 14312"},{"$f":"'Média de preços'!$H26","v":30},{"$f":"'Média de preços'!D26","v":2500},{"$f":"'Média de preços'!$P26","v":"BAL COMERCIO E SERVICOS LTDA"},"11.317.774/0001-67",{"$f":"'Média de preços'!$Q26","v":21.5},53750,0.28333333333333333]
[23,{"$f":"'Média de preços'!$B27","v":"TUBO GALVANIZADO COM ROSCA BSP E LUVA, DN 1 ¹/² \", PN 15 Kgf / cm², CLASSE M - NBR 5580"},{"$f":"'Média de preços'!$H27","v":"CANCELADO"}]
[24,{"$f":"'Média de preços'!$B28","v":"(Cota de até 25% - Exclusivo para ME e EPP): TUBO GALVANIZADO COM ROSCA BSP E LUVA, DN 1 ¹/² \", PN 15 Kgf / cm², CLASSE M - NBR 5580"},{"$f":"'Média de preços'!$H28","v":"CANCELADO"}]
[25,{"$f":"'Média de preços'!$B29","v":"TUBO DE PVC PBA, CLASSE 15, JUNTA ELASTICA, REDE AGUA, COMPRIMENTO 6M, DN-75MM - NBR 5647"},{"$f":"'Média de preços'!$H29","v":126.12},{"$f":"'Média de preços'!D29","v":1800},{"$f":"'Média de preços'!$P29","v":"POLYVIN PLASTICOS E DERIVADOS LTDA"},"41.664.871/0001-97",{"$f":"'Média de preços'!$Q29","v":92},{"$f":"$D27*$G27","v":165600},{"$f":"($C27-$G27)/$C27","v":0.27053599746273393}]
[26,{"$f":"'Média de preços'!$B30","v":"(Cota de até 25% - Exclusivo para ME e EPP): TUBO DE PVC PBA, CLASSE 15, JUNTA ELASTICA, REDE AGUA, COMPRIMENTO 6M, DN-75MM - NBR 5647"},{"$f":"'Média de preços'!$H30","v":126.12},{"$f":"'Média de preços'!D30","v":200},{"$f":"'Média de preços'!$P30","v":"BAL COMERCIO E SERVICOS LTDA"},"11.317.774/0001-67",{"$f":"'Média de preços'!$Q30","v":99},19800,0.21503330161750717]
[27,{"$f":"'Média de preços'!$B31","v":"TUBO DE PVC PBA, CLASSE 15, JUNTA ELASTICA, REDE AGUA, COMPRIMENTO 6M, DN-100MM - NBR 5647"},{"$f":"'Média de preços'!$H31","v":209.04},{"$f":"'Média de preços'!D31","v":1800},{"$f":"'Média de preços'!$P31","v":"POLYVIN PLASTICOS E DERIVADOS LTDA"},"41.664.871/0001-97",{"$f":"'Média de preços'!$Q31","v":149},268200,0.28721775736701105]
[28,{"$f":"'Média de preços'!$B32","v":"(Cota de até 25% - Exclusivo para ME e EPP): TUBO DE PVC PBA, CLASSE 15, JUNTA ELASTICA, REDE AGUA, COMPRIMENTO 6M, DN-100MM - NBR 5647"},{"$f":"'Média de preços'!$H32","v":209.04},{"$f":"'Média de preços'!D32","v":200},{"$f":"'Média de preços'!$P32","v":"BAL COMERCIO E SERVICOS LTDA"},"11.317.774/0001-67",{"$f":"'Média de preços'!$Q32","v":165},33000,0.21067738231917332]
[29,{"$f":"'Média de preços'!B33","v":"CABO TRIPOLAR DE 3x10mm, SISTEMA FLEXÍVEL, 1.000v"},{"$f":"'Média de preços'!$H33","v":"CANCELADO"}]
[30,{"$f":"'Média de preços'!$B34","v":"FIO ENCAPADO 10mm"},{"$f":"'Média de preços'!$H34","v":"CANCELADO"}]
[31,{"$f":"'Média de preços'!B35","v":"HIDRÔMETRO UNIJATO 3/4\" COM VAZÃO NOMINAL = 1,5 M³ CONFORME NBR 8009, 8193 A 8195 DA ABNT, INCLUSO VIROLAS"},{"$f":"'Média de preços'!$H35","v":110.73},{"$f":"'Média de preços'!D35","v":1800},{"$f":"'Média de preços'!P35","v":"SAGA MEDICAO LTDA"},"08.026.075/0001-53",{"$f":"'Média de preços'!$Q35","v":75},{"$f":"$D33*$G33","v":135000},{"$f":"($C33-$G33)/$C33","v":0.32267678136006506}]
[32,{"$f":"'Média de preços'!B36","v":"(Cota de até 25% - Exclusivo para ME e EPP): HIDRÔMETRO UNIJATO 3/4\" COM VAZÃO NOMINAL = 1,5 M³ CONFORME NBR 8009, 8193 A 8195 DA ABNT, INCLUSO VIROLAS"},{"$f":"'Média de preços'!$H36","v":110.73},{"$f":"'Média de preços'!D36","v":200},{"$f":"'Média de preços'!P36","v":"HG COMERCIO DE MATERIAIS HIDRAULICOS EIRELI"},"04.722.894/0001-84",{"$f":"'Média de preços'!$Q36","v":75},15000,0.32267678136006506]
[33,{"$f":"'Média de preços'!$B36","v":"(Cota de até 25% - Exclusivo para ME e EPP): HIDRÔMETRO UNIJATO 3/4\" COM VAZÃO NOMINAL = 1,5 M³ CONFORME NBR 8009, 8193 A 8195 DA ABNT, INCLUSO VIROLAS"},"Deserto"]
[34,{"$f":"'Média de preços'!$B37","v":"TUBO CONCRETO ARMADO, CLASSE PA-2, PB, DN 1000 MM, PARA AGUAS PLUVIAIS (NBR8890)"},"Deserto"]
[35,{"$f":"'Média de preços'!$B38","v":"(Cota de até 25% - Exclusivo para ME e EPP): TUBO CONCRETO ARMADO, CLASSE PA-2, PB, DN 1000 MM, PARA AGUAS PLUVIAIS (NBR8890)"},{"$f":"'Média de preços'!$H39","v":418},{"$f":"'Média de preços'!D39","v":100},{"$f":"'Média de preços'!P39","v":"RPF COMERCIAL EIRELI"},"\n03.217.016/0001-49",{"$f":"'Média de preços'!Q39","v":418},{"$f":"$D37*$G37","v":41800},{"$f":"($C37-$G37)/$C37","v":0}]
[{"$nulls":6},"TOTAL GERAL",{"$f":"SUM(H3:H24,H27:H30,H33:H34,H37)","v":6278842.5500000007}]